AutoFeedback API

Logs 870946cd-d1d9-439d-805e-72c095afba74

17:37:30 [PREPARING] [INFO] Scanning for projects...
17:37:30 [PREPARING] [INFO]
17:37:30 [PREPARING] [INFO] -----------------------< prog1:objects-classes >------------------------
17:37:30 [PREPARING] [INFO] Building objects-classes 1.0-SNAPSHOT
17:37:30 [PREPARING] [INFO]   from pom.xml
17:37:30 [PREPARING] [INFO] --------------------------------[ jar ]---------------------------------
17:37:31 [PREPARING] [INFO] Loaded 23964 auto-discovered prefixes for remote repository central (prefixes-central.txt)
17:37:32 [PREPARING] [WARNING] org.junit.jupiter:junit-jupiter:pom:5.13.4 was downloaded from https://repo.maven.apache.org/maven2 while a cached not-found from a previous attempt suppresses re-checking https://gitlab.fhnw.ch/api/v4/projects/17730/packages/maven/; expiring the cached not-found so that repository is checked again on the next resolution
17:37:32 [PREPARING] [WARNING] org.junit:junit-bom:pom:5.13.4 was downloaded from https://repo.maven.apache.org/maven2 while a cached not-found from a previous attempt suppresses re-checking https://gitlab.fhnw.ch/api/v4/projects/17730/packages/maven/; expiring the cached not-found so that repository is checked again on the next resolution
17:37:33 [PREPARING] [WARNING] jakarta.websocket:jakarta.websocket-api:pom:2.0.0 was downloaded from https://repo.maven.apache.org/maven2 while a cached not-found from a previous attempt suppresses re-checking https://gitlab.fhnw.ch/api/v4/projects/17730/packages/maven/; expiring the cached not-found so that repository is checked again on the next resolution
17:37:33 [PREPARING] [WARNING] org.slf4j:slf4j-simple:pom:2.0.9 was downloaded from https://repo.maven.apache.org/maven2 while a cached not-found from a previous attempt suppresses re-checking https://gitlab.fhnw.ch/api/v4/projects/17730/packages/maven/; expiring the cached not-found so that repository is checked again on the next resolution
17:37:33 [PREPARING] [WARNING] org.eclipse.jetty:jetty-server:pom:11.0.24 was downloaded from https://repo.maven.apache.org/maven2 while a cached not-found from a previous attempt suppresses re-checking https://gitlab.fhnw.ch/api/v4/projects/17730/packages/maven/; expiring the cached not-found so that repository is checked again on the next resolution
17:37:33 [PREPARING] [WARNING] jakarta.servlet:jakarta.servlet-api:pom:5.0.0 was downloaded from https://repo.maven.apache.org/maven2 while a cached not-found from a previous attempt suppresses re-checking https://gitlab.fhnw.ch/api/v4/projects/17730/packages/maven/; expiring the cached not-found so that repository is checked again on the next resolution
17:37:33 [PREPARING] [WARNING] org.eclipse.jetty.websocket:websocket-jakarta-server:pom:11.0.24 was downloaded from https://repo.maven.apache.org/maven2 while a cached not-found from a previous attempt suppresses re-checking https://gitlab.fhnw.ch/api/v4/projects/17730/packages/maven/; expiring the cached not-found so that repository is checked again on the next resolution
17:37:33 [PREPARING] [WARNING] jakarta.websocket:jakarta.websocket-all:pom:2.0.0 was downloaded from https://repo.maven.apache.org/maven2 while a cached not-found from a previous attempt suppresses re-checking https://gitlab.fhnw.ch/api/v4/projects/17730/packages/maven/; expiring the cached not-found so that repository is checked again on the next resolution
17:37:33 [PREPARING] [WARNING] org.slf4j:slf4j-parent:pom:2.0.9 was downloaded from https://repo.maven.apache.org/maven2 while a cached not-found from a previous attempt suppresses re-checking https://gitlab.fhnw.ch/api/v4/projects/17730/packages/maven/; expiring the cached not-found so that repository is checked again on the next resolution
17:37:33 [PREPARING] [WARNING] org.eclipse.jetty.websocket:websocket-parent:pom:11.0.24 was downloaded from https://repo.maven.apache.org/maven2 while a cached not-found from a previous attempt suppresses re-checking https://gitlab.fhnw.ch/api/v4/projects/17730/packages/maven/; expiring the cached not-found so that repository is checked again on the next resolution
17:37:33 [PREPARING] [WARNING] org.eclipse.jetty:jetty-project:pom:11.0.24 was downloaded from https://repo.maven.apache.org/maven2 while a cached not-found from a previous attempt suppresses re-checking https://gitlab.fhnw.ch/api/v4/projects/17730/packages/maven/; expiring the cached not-found so that repository is checked again on the next resolution
17:37:33 [PREPARING] [WARNING] org.eclipse.ee4j:project:pom:1.0.6 was downloaded from https://repo.maven.apache.org/maven2 while a cached not-found from a previous attempt suppresses re-checking https://gitlab.fhnw.ch/api/v4/projects/17730/packages/maven/; expiring the cached not-found so that repository is checked again on the next resolution
17:37:33 [PREPARING] [WARNING] org.slf4j:slf4j-bom:pom:2.0.9 was downloaded from https://repo.maven.apache.org/maven2 while a cached not-found from a previous attempt suppresses re-checking https://gitlab.fhnw.ch/api/v4/projects/17730/packages/maven/; expiring the cached not-found so that repository is checked again on the next resolution
17:37:33 [PREPARING] [WARNING] org.junit.jupiter:junit-jupiter-api:pom:5.13.4 was downloaded from https://repo.maven.apache.org/maven2 while a cached not-found from a previous attempt suppresses re-checking https://gitlab.fhnw.ch/api/v4/projects/17730/packages/maven/; expiring the cached not-found so that repository is checked again on the next resolution
17:37:33 [PREPARING] [WARNING] com.fasterxml.jackson:jackson-bom:pom:2.17.2 was downloaded from https://repo.maven.apache.org/maven2 while a cached not-found from a previous attempt suppresses re-checking https://gitlab.fhnw.ch/api/v4/projects/17730/packages/maven/; expiring the cached not-found so that repository is checked again on the next resolution
17:37:33 [PREPARING] [WARNING] org.junit.jupiter:junit-jupiter-params:pom:5.13.4 was downloaded from https://repo.maven.apache.org/maven2 while a cached not-found from a previous attempt suppresses re-checking https://gitlab.fhnw.ch/api/v4/projects/17730/packages/maven/; expiring the cached not-found so that repository is checked again on the next resolution
17:37:33 [PREPARING] [WARNING] org.junit.jupiter:junit-jupiter-engine:pom:5.13.4 was downloaded from https://repo.maven.apache.org/maven2 while a cached not-found from a previous attempt suppresses re-checking https://gitlab.fhnw.ch/api/v4/projects/17730/packages/maven/; expiring the cached not-found so that repository is checked again on the next resolution
17:37:34 [PREPARING] [WARNING] com.fasterxml.jackson:jackson-parent:pom:2.17 was downloaded from https://repo.maven.apache.org/maven2 while a cached not-found from a previous attempt suppresses re-checking https://gitlab.fhnw.ch/api/v4/projects/17730/packages/maven/; expiring the cached not-found so that repository is checked again on the next resolution
17:37:34 [PREPARING] [WARNING] com.fasterxml:oss-parent:pom:58 was downloaded from https://repo.maven.apache.org/maven2 while a cached not-found from a previous attempt suppresses re-checking https://gitlab.fhnw.ch/api/v4/projects/17730/packages/maven/; expiring the cached not-found so that repository is checked again on the next resolution
17:37:34 [PREPARING] [WARNING] org.infinispan:infinispan-bom:pom:11.0.19.Final was downloaded from https://repo.maven.apache.org/maven2 while a cached not-found from a previous attempt suppresses re-checking https://gitlab.fhnw.ch/api/v4/projects/17730/packages/maven/; expiring the cached not-found so that repository is checked again on the next resolution
17:37:34 [PREPARING] [WARNING] org.infinispan:infinispan-build-configuration-parent:pom:11.0.19.Final was downloaded from https://repo.maven.apache.org/maven2 while a cached not-found from a previous attempt suppresses re-checking https://gitlab.fhnw.ch/api/v4/projects/17730/packages/maven/; expiring the cached not-found so that repository is checked again on the next resolution
17:37:34 [PREPARING] [WARNING] org.jboss:jboss-parent:pom:36 was downloaded from https://repo.maven.apache.org/maven2 while a cached not-found from a previous attempt suppresses re-checking https://gitlab.fhnw.ch/api/v4/projects/17730/packages/maven/; expiring the cached not-found so that repository is checked again on the next resolution
17:37:34 [PREPARING] [WARNING] org.junit:junit-bom:pom:5.10.3 was downloaded from https://repo.maven.apache.org/maven2 while a cached not-found from a previous attempt suppresses re-checking https://gitlab.fhnw.ch/api/v4/projects/17730/packages/maven/; expiring the cached not-found so that repository is checked again on the next resolution
17:37:34 [PREPARING] [WARNING] org.ow2.asm:asm-bom:pom:9.7 was downloaded from https://repo.maven.apache.org/maven2 while a cached not-found from a previous attempt suppresses re-checking https://gitlab.fhnw.ch/api/v4/projects/17730/packages/maven/; expiring the cached not-found so that repository is checked again on the next resolution
17:37:34 [PREPARING] [WARNING] org.ow2:ow2:pom:1.5.1 was downloaded from https://repo.maven.apache.org/maven2 while a cached not-found from a previous attempt suppresses re-checking https://gitlab.fhnw.ch/api/v4/projects/17730/packages/maven/; expiring the cached not-found so that repository is checked again on the next resolution
17:37:35 [PREPARING] [WARNING] org.testcontainers:testcontainers-bom:pom:1.20.1 was downloaded from https://repo.maven.apache.org/maven2 while a cached not-found from a previous attempt suppresses re-checking https://gitlab.fhnw.ch/api/v4/projects/17730/packages/maven/; expiring the cached not-found so that repository is checked again on the next resolution
17:37:35 [PREPARING] [WARNING] org.slf4j:slf4j-api:pom:2.0.9 was downloaded from https://repo.maven.apache.org/maven2 while a cached not-found from a previous attempt suppresses re-checking https://gitlab.fhnw.ch/api/v4/projects/17730/packages/maven/; expiring the cached not-found so that repository is checked again on the next resolution
17:37:35 [PREPARING] [WARNING] org.eclipse.jetty:jetty-annotations:pom:11.0.24 was downloaded from https://repo.maven.apache.org/maven2 while a cached not-found from a previous attempt suppresses re-checking https://gitlab.fhnw.ch/api/v4/projects/17730/packages/maven/; expiring the cached not-found so that repository is checked again on the next resolution
17:37:35 [PREPARING] [WARNING] org.eclipse.jetty.toolchain:jetty-jakarta-servlet-api:pom:5.0.2 was downloaded from https://repo.maven.apache.org/maven2 while a cached not-found from a previous attempt suppresses re-checking https://gitlab.fhnw.ch/api/v4/projects/17730/packages/maven/; expiring the cached not-found so that repository is checked again on the next resolution
17:37:35 [PREPARING] [WARNING] org.eclipse.jetty:jetty-io:pom:11.0.24 was downloaded from https://repo.maven.apache.org/maven2 while a cached not-found from a previous attempt suppresses re-checking https://gitlab.fhnw.ch/api/v4/projects/17730/packages/maven/; expiring the cached not-found so that repository is checked again on the next resolution
17:37:35 [PREPARING] [WARNING] org.eclipse.jetty:jetty-http:pom:11.0.24 was downloaded from https://repo.maven.apache.org/maven2 while a cached not-found from a previous attempt suppresses re-checking https://gitlab.fhnw.ch/api/v4/projects/17730/packages/maven/; expiring the cached not-found so that repository is checked again on the next resolution
17:37:35 [PREPARING] [WARNING] org.eclipse.jetty.websocket:websocket-jakarta-client:pom:11.0.24 was downloaded from https://repo.maven.apache.org/maven2 while a cached not-found from a previous attempt suppresses re-checking https://gitlab.fhnw.ch/api/v4/projects/17730/packages/maven/; expiring the cached not-found so that repository is checked again on the next resolution
17:37:35 [PREPARING] [WARNING] org.eclipse.jetty.websocket:websocket-servlet:pom:11.0.24 was downloaded from https://repo.maven.apache.org/maven2 while a cached not-found from a previous attempt suppresses re-checking https://gitlab.fhnw.ch/api/v4/projects/17730/packages/maven/; expiring the cached not-found so that repository is checked again on the next resolution
17:37:35 [PREPARING] [WARNING] org.eclipse.jetty.toolchain:jetty-jakarta-websocket-api:pom:2.0.0 was downloaded from https://repo.maven.apache.org/maven2 while a cached not-found from a previous attempt suppresses re-checking https://gitlab.fhnw.ch/api/v4/projects/17730/packages/maven/; expiring the cached not-found so that repository is checked again on the next resolution
17:37:35 [PREPARING] [WARNING] org.opentest4j:opentest4j:pom:1.3.0 was downloaded from https://repo.maven.apache.org/maven2 while a cached not-found from a previous attempt suppresses re-checking https://gitlab.fhnw.ch/api/v4/projects/17730/packages/maven/; expiring the cached not-found so that repository is checked again on the next resolution
17:37:35 [PREPARING] [WARNING] org.junit.platform:junit-platform-commons:pom:1.13.4 was downloaded from https://repo.maven.apache.org/maven2 while a cached not-found from a previous attempt suppresses re-checking https://gitlab.fhnw.ch/api/v4/projects/17730/packages/maven/; expiring the cached not-found so that repository is checked again on the next resolution
17:37:35 [PREPARING] [WARNING] org.eclipse.jetty.toolchain:jetty-toolchain:pom:1.6 was downloaded from https://repo.maven.apache.org/maven2 while a cached not-found from a previous attempt suppresses re-checking https://gitlab.fhnw.ch/api/v4/projects/17730/packages/maven/; expiring the cached not-found so that repository is checked again on the next resolution
17:37:35 [PREPARING] [WARNING] org.eclipse.jetty.toolchain:jetty-toolchain:pom:1.7 was downloaded from https://repo.maven.apache.org/maven2 while a cached not-found from a previous attempt suppresses re-checking https://gitlab.fhnw.ch/api/v4/projects/17730/packages/maven/; expiring the cached not-found so that repository is checked again on the next resolution
17:37:35 [PREPARING] [WARNING] org.apiguardian:apiguardian-api:pom:1.1.2 was downloaded from https://repo.maven.apache.org/maven2 while a cached not-found from a previous attempt suppresses re-checking https://gitlab.fhnw.ch/api/v4/projects/17730/packages/maven/; expiring the cached not-found so that repository is checked again on the next resolution
17:37:35 [PREPARING] [WARNING] org.junit.platform:junit-platform-engine:pom:1.13.4 was downloaded from https://repo.maven.apache.org/maven2 while a cached not-found from a previous attempt suppresses re-checking https://gitlab.fhnw.ch/api/v4/projects/17730/packages/maven/; expiring the cached not-found so that repository is checked again on the next resolution
17:37:35 [PREPARING] [WARNING] org.eclipse.jetty:jetty-plus:pom:11.0.24 was downloaded from https://repo.maven.apache.org/maven2 while a cached not-found from a previous attempt suppresses re-checking https://gitlab.fhnw.ch/api/v4/projects/17730/packages/maven/; expiring the cached not-found so that repository is checked again on the next resolution
17:37:35 [PREPARING] [WARNING] org.eclipse.jetty:jetty-util:pom:11.0.24 was downloaded from https://repo.maven.apache.org/maven2 while a cached not-found from a previous attempt suppresses re-checking https://gitlab.fhnw.ch/api/v4/projects/17730/packages/maven/; expiring the cached not-found so that repository is checked again on the next resolution
17:37:35 [PREPARING] [WARNING] jakarta.annotation:jakarta.annotation-api:pom:2.1.1 was downloaded from https://repo.maven.apache.org/maven2 while a cached not-found from a previous attempt suppresses re-checking https://gitlab.fhnw.ch/api/v4/projects/17730/packages/maven/; expiring the cached not-found so that repository is checked again on the next resolution
17:37:35 [PREPARING] [WARNING] org.eclipse.jetty:jetty-webapp:pom:11.0.24 was downloaded from https://repo.maven.apache.org/maven2 while a cached not-found from a previous attempt suppresses re-checking https://gitlab.fhnw.ch/api/v4/projects/17730/packages/maven/; expiring the cached not-found so that repository is checked again on the next resolution
17:37:35 [PREPARING] [WARNING] org.ow2.asm:asm-commons:pom:9.7 was downloaded from https://repo.maven.apache.org/maven2 while a cached not-found from a previous attempt suppresses re-checking https://gitlab.fhnw.ch/api/v4/projects/17730/packages/maven/; expiring the cached not-found so that repository is checked again on the next resolution
17:37:35 [PREPARING] [WARNING] org.eclipse.ee4j:project:pom:1.0.7 was downloaded from https://repo.maven.apache.org/maven2 while a cached not-found from a previous attempt suppresses re-checking https://gitlab.fhnw.ch/api/v4/projects/17730/packages/maven/; expiring the cached not-found so that repository is checked again on the next resolution
17:37:35 [PREPARING] [WARNING] org.eclipse.jetty:jetty-client:pom:11.0.24 was downloaded from https://repo.maven.apache.org/maven2 while a cached not-found from a previous attempt suppresses re-checking https://gitlab.fhnw.ch/api/v4/projects/17730/packages/maven/; expiring the cached not-found so that repository is checked again on the next resolution
17:37:35 [PREPARING] [WARNING] org.eclipse.jetty.websocket:websocket-core-client:pom:11.0.24 was downloaded from https://repo.maven.apache.org/maven2 while a cached not-found from a previous attempt suppresses re-checking https://gitlab.fhnw.ch/api/v4/projects/17730/packages/maven/; expiring the cached not-found so that repository is checked again on the next resolution
17:37:35 [PREPARING] [WARNING] org.eclipse.jetty.websocket:websocket-jakarta-common:pom:11.0.24 was downloaded from https://repo.maven.apache.org/maven2 while a cached not-found from a previous attempt suppresses re-checking https://gitlab.fhnw.ch/api/v4/projects/17730/packages/maven/; expiring the cached not-found so that repository is checked again on the next resolution
17:37:35 [PREPARING] [WARNING] org.ow2.asm:asm:pom:9.7 was downloaded from https://repo.maven.apache.org/maven2 while a cached not-found from a previous attempt suppresses re-checking https://gitlab.fhnw.ch/api/v4/projects/17730/packages/maven/; expiring the cached not-found so that repository is checked again on the next resolution
17:37:35 [PREPARING] [WARNING] org.eclipse.jetty:jetty-servlet:pom:11.0.24 was downloaded from https://repo.maven.apache.org/maven2 while a cached not-found from a previous attempt suppresses re-checking https://gitlab.fhnw.ch/api/v4/projects/17730/packages/maven/; expiring the cached not-found so that repository is checked again on the next resolution
17:37:35 [PREPARING] [WARNING] org.eclipse.jetty.websocket:websocket-core-server:pom:11.0.24 was downloaded from https://repo.maven.apache.org/maven2 while a cached not-found from a previous attempt suppresses re-checking https://gitlab.fhnw.ch/api/v4/projects/17730/packages/maven/; expiring the cached not-found so that repository is checked again on the next resolution
17:37:35 [PREPARING] [WARNING] jakarta.transaction:jakarta.transaction-api:pom:2.0.0 was downloaded from https://repo.maven.apache.org/maven2 while a cached not-found from a previous attempt suppresses re-checking https://gitlab.fhnw.ch/api/v4/projects/17730/packages/maven/; expiring the cached not-found so that repository is checked again on the next resolution
17:37:35 [PREPARING] [WARNING] org.eclipse.jetty:jetty-alpn-client:pom:11.0.24 was downloaded from https://repo.maven.apache.org/maven2 while a cached not-found from a previous attempt suppresses re-checking https://gitlab.fhnw.ch/api/v4/projects/17730/packages/maven/; expiring the cached not-found so that repository is checked again on the next resolution
17:37:35 [PREPARING] [WARNING] org.eclipse.jetty:jetty-jndi:pom:11.0.24 was downloaded from https://repo.maven.apache.org/maven2 while a cached not-found from a previous attempt suppresses re-checking https://gitlab.fhnw.ch/api/v4/projects/17730/packages/maven/; expiring the cached not-found so that repository is checked again on the next resolution
17:37:35 [PREPARING] [WARNING] org.eclipse.jetty:jetty-xml:pom:11.0.24 was downloaded from https://repo.maven.apache.org/maven2 while a cached not-found from a previous attempt suppresses re-checking https://gitlab.fhnw.ch/api/v4/projects/17730/packages/maven/; expiring the cached not-found so that repository is checked again on the next resolution
17:37:35 [PREPARING] [INFO] Loaded 50 auto-discovered prefixes for remote repository ow2-snapshot (prefixes-ow2-snapshot.txt)
17:37:35 [PREPARING] [WARNING] org.eclipse.jetty:jetty-alpn-parent:pom:11.0.24 was downloaded from https://repo.maven.apache.org/maven2 while a cached not-found from a previous attempt suppresses re-checking https://gitlab.fhnw.ch/api/v4/projects/17730/packages/maven/; expiring the cached not-found so that repository is checked again on the next resolution
17:37:35 [PREPARING] [WARNING] org.eclipse.jetty:jetty-security:pom:11.0.24 was downloaded from https://repo.maven.apache.org/maven2 while a cached not-found from a previous attempt suppresses re-checking https://gitlab.fhnw.ch/api/v4/projects/17730/packages/maven/; expiring the cached not-found so that repository is checked again on the next resolution
17:37:35 [PREPARING] [WARNING] org.ow2.asm:asm-tree:pom:9.7 was downloaded from https://repo.maven.apache.org/maven2 while a cached not-found from a previous attempt suppresses re-checking https://gitlab.fhnw.ch/api/v4/projects/17730/packages/maven/; expiring the cached not-found so that repository is checked again on the next resolution
17:37:35 [PREPARING] [WARNING] org.eclipse.jetty.websocket:websocket-core-common:pom:11.0.24 was downloaded from https://repo.maven.apache.org/maven2 while a cached not-found from a previous attempt suppresses re-checking https://gitlab.fhnw.ch/api/v4/projects/17730/packages/maven/; expiring the cached not-found so that repository is checked again on the next resolution
17:37:36 [PREPARING] [WARNING] org.junit.jupiter:junit-jupiter:jar:5.13.4 was downloaded from https://repo.maven.apache.org/maven2 while a cached not-found from a previous attempt suppresses re-checking https://gitlab.fhnw.ch/api/v4/projects/17730/packages/maven/; expiring the cached not-found so that repository is checked again on the next resolution
17:37:36 [PREPARING] [WARNING] jakarta.servlet:jakarta.servlet-api:jar:5.0.0 was downloaded from https://repo.maven.apache.org/maven2 while a cached not-found from a previous attempt suppresses re-checking https://gitlab.fhnw.ch/api/v4/projects/17730/packages/maven/; expiring the cached not-found so that repository is checked again on the next resolution
17:37:36 [PREPARING] [WARNING] jakarta.websocket:jakarta.websocket-api:jar:2.0.0 was downloaded from https://repo.maven.apache.org/maven2 while a cached not-found from a previous attempt suppresses re-checking https://gitlab.fhnw.ch/api/v4/projects/17730/packages/maven/; expiring the cached not-found so that repository is checked again on the next resolution
17:37:36 [PREPARING] [WARNING] org.eclipse.jetty:jetty-server:jar:11.0.24 was downloaded from https://repo.maven.apache.org/maven2 while a cached not-found from a previous attempt suppresses re-checking https://gitlab.fhnw.ch/api/v4/projects/17730/packages/maven/; expiring the cached not-found so that repository is checked again on the next resolution
17:37:36 [PREPARING] [WARNING] org.eclipse.jetty.websocket:websocket-jakarta-server:jar:11.0.24 was downloaded from https://repo.maven.apache.org/maven2 while a cached not-found from a previous attempt suppresses re-checking https://gitlab.fhnw.ch/api/v4/projects/17730/packages/maven/; expiring the cached not-found so that repository is checked again on the next resolution
17:37:36 [PREPARING] [WARNING] org.slf4j:slf4j-simple:jar:2.0.9 was downloaded from https://repo.maven.apache.org/maven2 while a cached not-found from a previous attempt suppresses re-checking https://gitlab.fhnw.ch/api/v4/projects/17730/packages/maven/; expiring the cached not-found so that repository is checked again on the next resolution
17:37:36 [PREPARING] [WARNING] org.junit.jupiter:junit-jupiter-api:jar:5.13.4 was downloaded from https://repo.maven.apache.org/maven2 while a cached not-found from a previous attempt suppresses re-checking https://gitlab.fhnw.ch/api/v4/projects/17730/packages/maven/; expiring the cached not-found so that repository is checked again on the next resolution
17:37:36 [PREPARING] [WARNING] org.junit.jupiter:junit-jupiter-params:jar:5.13.4 was downloaded from https://repo.maven.apache.org/maven2 while a cached not-found from a previous attempt suppresses re-checking https://gitlab.fhnw.ch/api/v4/projects/17730/packages/maven/; expiring the cached not-found so that repository is checked again on the next resolution
17:37:36 [PREPARING] [WARNING] org.junit.jupiter:junit-jupiter-engine:jar:5.13.4 was downloaded from https://repo.maven.apache.org/maven2 while a cached not-found from a previous attempt suppresses re-checking https://gitlab.fhnw.ch/api/v4/projects/17730/packages/maven/; expiring the cached not-found so that repository is checked again on the next resolution
17:37:36 [PREPARING] [WARNING] org.eclipse.jetty:jetty-http:jar:11.0.24 was downloaded from https://repo.maven.apache.org/maven2 while a cached not-found from a previous attempt suppresses re-checking https://gitlab.fhnw.ch/api/v4/projects/17730/packages/maven/; expiring the cached not-found so that repository is checked again on the next resolution
17:37:36 [PREPARING] [WARNING] org.eclipse.jetty:jetty-io:jar:11.0.24 was downloaded from https://repo.maven.apache.org/maven2 while a cached not-found from a previous attempt suppresses re-checking https://gitlab.fhnw.ch/api/v4/projects/17730/packages/maven/; expiring the cached not-found so that repository is checked again on the next resolution
17:37:36 [PREPARING] [WARNING] org.eclipse.jetty.toolchain:jetty-jakarta-servlet-api:jar:5.0.2 was downloaded from https://repo.maven.apache.org/maven2 while a cached not-found from a previous attempt suppresses re-checking https://gitlab.fhnw.ch/api/v4/projects/17730/packages/maven/; expiring the cached not-found so that repository is checked again on the next resolution
17:37:36 [PREPARING] [WARNING] org.slf4j:slf4j-api:jar:2.0.9 was downloaded from https://repo.maven.apache.org/maven2 while a cached not-found from a previous attempt suppresses re-checking https://gitlab.fhnw.ch/api/v4/projects/17730/packages/maven/; expiring the cached not-found so that repository is checked again on the next resolution
17:37:36 [PREPARING] [WARNING] org.eclipse.jetty:jetty-annotations:jar:11.0.24 was downloaded from https://repo.maven.apache.org/maven2 while a cached not-found from a previous attempt suppresses re-checking https://gitlab.fhnw.ch/api/v4/projects/17730/packages/maven/; expiring the cached not-found so that repository is checked again on the next resolution
17:37:36 [PREPARING] [WARNING] org.eclipse.jetty.toolchain:jetty-jakarta-websocket-api:jar:2.0.0 was downloaded from https://repo.maven.apache.org/maven2 while a cached not-found from a previous attempt suppresses re-checking https://gitlab.fhnw.ch/api/v4/projects/17730/packages/maven/; expiring the cached not-found so that repository is checked again on the next resolution
17:37:36 [PREPARING] [WARNING] org.eclipse.jetty.websocket:websocket-jakarta-client:jar:11.0.24 was downloaded from https://repo.maven.apache.org/maven2 while a cached not-found from a previous attempt suppresses re-checking https://gitlab.fhnw.ch/api/v4/projects/17730/packages/maven/; expiring the cached not-found so that repository is checked again on the next resolution
17:37:36 [PREPARING] [WARNING] org.eclipse.jetty.websocket:websocket-servlet:jar:11.0.24 was downloaded from https://repo.maven.apache.org/maven2 while a cached not-found from a previous attempt suppresses re-checking https://gitlab.fhnw.ch/api/v4/projects/17730/packages/maven/; expiring the cached not-found so that repository is checked again on the next resolution
17:37:36 [PREPARING] [WARNING] org.opentest4j:opentest4j:jar:1.3.0 was downloaded from https://repo.maven.apache.org/maven2 while a cached not-found from a previous attempt suppresses re-checking https://gitlab.fhnw.ch/api/v4/projects/17730/packages/maven/; expiring the cached not-found so that repository is checked again on the next resolution
17:37:36 [PREPARING] [WARNING] org.junit.platform:junit-platform-commons:jar:1.13.4 was downloaded from https://repo.maven.apache.org/maven2 while a cached not-found from a previous attempt suppresses re-checking https://gitlab.fhnw.ch/api/v4/projects/17730/packages/maven/; expiring the cached not-found so that repository is checked again on the next resolution
17:37:36 [PREPARING] [WARNING] org.apiguardian:apiguardian-api:jar:1.1.2 was downloaded from https://repo.maven.apache.org/maven2 while a cached not-found from a previous attempt suppresses re-checking https://gitlab.fhnw.ch/api/v4/projects/17730/packages/maven/; expiring the cached not-found so that repository is checked again on the next resolution
17:37:36 [PREPARING] [WARNING] org.junit.platform:junit-platform-engine:jar:1.13.4 was downloaded from https://repo.maven.apache.org/maven2 while a cached not-found from a previous attempt suppresses re-checking https://gitlab.fhnw.ch/api/v4/projects/17730/packages/maven/; expiring the cached not-found so that repository is checked again on the next resolution
17:37:36 [PREPARING] [WARNING] org.eclipse.jetty:jetty-util:jar:11.0.24 was downloaded from https://repo.maven.apache.org/maven2 while a cached not-found from a previous attempt suppresses re-checking https://gitlab.fhnw.ch/api/v4/projects/17730/packages/maven/; expiring the cached not-found so that repository is checked again on the next resolution
17:37:36 [PREPARING] [WARNING] jakarta.annotation:jakarta.annotation-api:jar:2.1.1 was downloaded from https://repo.maven.apache.org/maven2 while a cached not-found from a previous attempt suppresses re-checking https://gitlab.fhnw.ch/api/v4/projects/17730/packages/maven/; expiring the cached not-found so that repository is checked again on the next resolution
17:37:36 [PREPARING] [WARNING] org.eclipse.jetty:jetty-plus:jar:11.0.24 was downloaded from https://repo.maven.apache.org/maven2 while a cached not-found from a previous attempt suppresses re-checking https://gitlab.fhnw.ch/api/v4/projects/17730/packages/maven/; expiring the cached not-found so that repository is checked again on the next resolution
17:37:36 [PREPARING] [WARNING] org.eclipse.jetty:jetty-webapp:jar:11.0.24 was downloaded from https://repo.maven.apache.org/maven2 while a cached not-found from a previous attempt suppresses re-checking https://gitlab.fhnw.ch/api/v4/projects/17730/packages/maven/; expiring the cached not-found so that repository is checked again on the next resolution
17:37:36 [PREPARING] [WARNING] org.ow2.asm:asm:jar:9.7 was downloaded from https://repo.maven.apache.org/maven2 while a cached not-found from a previous attempt suppresses re-checking https://gitlab.fhnw.ch/api/v4/projects/17730/packages/maven/; expiring the cached not-found so that repository is checked again on the next resolution
17:37:36 [PREPARING] [WARNING] org.ow2.asm:asm-commons:jar:9.7 was downloaded from https://repo.maven.apache.org/maven2 while a cached not-found from a previous attempt suppresses re-checking https://gitlab.fhnw.ch/api/v4/projects/17730/packages/maven/; expiring the cached not-found so that repository is checked again on the next resolution
17:37:36 [PREPARING] [WARNING] org.eclipse.jetty:jetty-client:jar:11.0.24 was downloaded from https://repo.maven.apache.org/maven2 while a cached not-found from a previous attempt suppresses re-checking https://gitlab.fhnw.ch/api/v4/projects/17730/packages/maven/; expiring the cached not-found so that repository is checked again on the next resolution
17:37:36 [PREPARING] [WARNING] org.eclipse.jetty.websocket:websocket-core-client:jar:11.0.24 was downloaded from https://repo.maven.apache.org/maven2 while a cached not-found from a previous attempt suppresses re-checking https://gitlab.fhnw.ch/api/v4/projects/17730/packages/maven/; expiring the cached not-found so that repository is checked again on the next resolution
17:37:36 [PREPARING] [WARNING] org.eclipse.jetty.websocket:websocket-jakarta-common:jar:11.0.24 was downloaded from https://repo.maven.apache.org/maven2 while a cached not-found from a previous attempt suppresses re-checking https://gitlab.fhnw.ch/api/v4/projects/17730/packages/maven/; expiring the cached not-found so that repository is checked again on the next resolution
17:37:36 [PREPARING] [WARNING] org.eclipse.jetty:jetty-servlet:jar:11.0.24 was downloaded from https://repo.maven.apache.org/maven2 while a cached not-found from a previous attempt suppresses re-checking https://gitlab.fhnw.ch/api/v4/projects/17730/packages/maven/; expiring the cached not-found so that repository is checked again on the next resolution
17:37:36 [PREPARING] [WARNING] org.eclipse.jetty.websocket:websocket-core-server:jar:11.0.24 was downloaded from https://repo.maven.apache.org/maven2 while a cached not-found from a previous attempt suppresses re-checking https://gitlab.fhnw.ch/api/v4/projects/17730/packages/maven/; expiring the cached not-found so that repository is checked again on the next resolution
17:37:36 [PREPARING] [WARNING] jakarta.transaction:jakarta.transaction-api:jar:2.0.0 was downloaded from https://repo.maven.apache.org/maven2 while a cached not-found from a previous attempt suppresses re-checking https://gitlab.fhnw.ch/api/v4/projects/17730/packages/maven/; expiring the cached not-found so that repository is checked again on the next resolution
17:37:36 [PREPARING] [WARNING] org.eclipse.jetty:jetty-jndi:jar:11.0.24 was downloaded from https://repo.maven.apache.org/maven2 while a cached not-found from a previous attempt suppresses re-checking https://gitlab.fhnw.ch/api/v4/projects/17730/packages/maven/; expiring the cached not-found so that repository is checked again on the next resolution
17:37:36 [PREPARING] [WARNING] org.eclipse.jetty:jetty-xml:jar:11.0.24 was downloaded from https://repo.maven.apache.org/maven2 while a cached not-found from a previous attempt suppresses re-checking https://gitlab.fhnw.ch/api/v4/projects/17730/packages/maven/; expiring the cached not-found so that repository is checked again on the next resolution
17:37:36 [PREPARING] [WARNING] org.ow2.asm:asm-tree:jar:9.7 was downloaded from https://repo.maven.apache.org/maven2 while a cached not-found from a previous attempt suppresses re-checking https://gitlab.fhnw.ch/api/v4/projects/17730/packages/maven/; expiring the cached not-found so that repository is checked again on the next resolution
17:37:36 [PREPARING] [WARNING] org.eclipse.jetty:jetty-alpn-client:jar:11.0.24 was downloaded from https://repo.maven.apache.org/maven2 while a cached not-found from a previous attempt suppresses re-checking https://gitlab.fhnw.ch/api/v4/projects/17730/packages/maven/; expiring the cached not-found so that repository is checked again on the next resolution
17:37:36 [PREPARING] [WARNING] org.eclipse.jetty.websocket:websocket-core-common:jar:11.0.24 was downloaded from https://repo.maven.apache.org/maven2 while a cached not-found from a previous attempt suppresses re-checking https://gitlab.fhnw.ch/api/v4/projects/17730/packages/maven/; expiring the cached not-found so that repository is checked again on the next resolution
17:37:36 [PREPARING] [WARNING] org.eclipse.jetty:jetty-security:jar:11.0.24 was downloaded from https://repo.maven.apache.org/maven2 while a cached not-found from a previous attempt suppresses re-checking https://gitlab.fhnw.ch/api/v4/projects/17730/packages/maven/; expiring the cached not-found so that repository is checked again on the next resolution
17:37:36 [PREPARING] [INFO]
17:37:36 [PREPARING] [INFO] --- clean:3.5.0:clean (default-clean) @ objects-classes ---
17:37:37 [PREPARING] [INFO]
17:37:37 [PREPARING] [INFO] --- resources:3.5.0:resources (default-resources) @ objects-classes ---
17:37:37 [PREPARING] [INFO] skip non existing resourceDirectory /git_2262367575734226142/src/main/resources
17:37:37 [PREPARING] [INFO]
17:37:37 [PREPARING] [INFO] --- compiler:3.16.0:compile (default-compile) @ objects-classes ---
17:37:37 [PREPARING] [INFO] Loaded 74 auto-discovered prefixes for remote repository apache.snapshots (prefixes-apache.snapshots.txt)
17:37:38 [PREPARING] [INFO] Recompiling the module because of changed source code.
17:37:38 [PREPARING] [INFO] Compiling 5 source files with javac [debug release 25] to target/classes
17:37:39 [PREPARING] [INFO] -------------------------------------------------------------
17:37:39 [PREPARING] [ERROR] COMPILATION ERROR :
17:37:39 [PREPARING] [INFO] -------------------------------------------------------------
17:37:39 [PREPARING] [ERROR] /git_2262367575734226142/src/main/java/ch/fhnw/prog1/exercise/todo/ToDoApp.java:[1,35] cannot find symbol
17:37:39 [PREPARING] symbol:   class Task
17:37:39 [PREPARING] location: package ch.fhnw.prog1.exercise.todo
17:37:39 [PREPARING] [ERROR] /git_2262367575734226142/src/main/java/ch/fhnw/prog1/exercise/todo/ToDoApp.java:[4,1] cannot find symbol
17:37:39 [PREPARING] symbol:   class Task
17:37:39 [PREPARING] location: class ToDoApp
17:37:39 [PREPARING] [ERROR] /git_2262367575734226142/src/main/java/ch/fhnw/prog1/exercise/todo/ToDoApp.java:[4,24] cannot find symbol
17:37:39 [PREPARING] symbol:   class Task
17:37:39 [PREPARING] location: class ToDoApp
17:37:39 [PREPARING] [ERROR] /git_2262367575734226142/src/main/java/ch/fhnw/prog1/exercise/todo/ToDoApp.java:[52,14] cannot find symbol
17:37:39 [PREPARING] symbol:   class Task
17:37:39 [PREPARING] location: class ToDoApp
17:37:39 [PREPARING] [ERROR] /git_2262367575734226142/src/main/java/ch/fhnw/prog1/exercise/todo/ToDoApp.java:[75,9] cannot find symbol
17:37:39 [PREPARING] symbol:   class Task
17:37:39 [PREPARING] location: class ToDoApp
17:37:39 [PREPARING] [ERROR] /git_2262367575734226142/src/main/java/ch/fhnw/prog1/exercise/todo/ToDoApp.java:[75,25] cannot find symbol
17:37:39 [PREPARING] symbol:   class Task
17:37:39 [PREPARING] location: class ToDoApp
17:37:39 [PREPARING] [INFO] 6 errors
17:37:39 [PREPARING] [INFO] -------------------------------------------------------------
17:37:39 [PREPARING] [INFO] ------------------------------------------------------------------------
17:37:39 [PREPARING] [ERROR] BUILD FAILURE
17:37:39 [PREPARING] [INFO] ------------------------------------------------------------------------
17:37:39 [PREPARING] [INFO] Total time:  8.438 s
17:37:39 [PREPARING] [INFO] Finished at: 2026-10-02T17:37:39Z
17:37:39 [PREPARING] [INFO] ------------------------------------------------------------------------
17:37:39 [PREPARING] [ERROR] Failed to execute goal org.apache.maven.plugins:maven-compiler-plugin:3.16.0:compile (default-compile) on project objects-classes: Compilation failure: Compilation failure:
17:37:39 [PREPARING] [ERROR] /git_2262367575734226142/src/main/java/ch/fhnw/prog1/exercise/todo/ToDoApp.java:[1,35] cannot find symbol
17:37:39 [PREPARING] [ERROR]   symbol:   class Task
17:37:39 [PREPARING] [ERROR]   location: package ch.fhnw.prog1.exercise.todo
17:37:39 [PREPARING] [ERROR] /git_2262367575734226142/src/main/java/ch/fhnw/prog1/exercise/todo/ToDoApp.java:[4,1] cannot find symbol
17:37:39 [PREPARING] [ERROR]   symbol:   class Task
17:37:39 [PREPARING] [ERROR]   location: class ToDoApp
17:37:39 [PREPARING] [ERROR] /git_2262367575734226142/src/main/java/ch/fhnw/prog1/exercise/todo/ToDoApp.java:[4,24] cannot find symbol
17:37:39 [PREPARING] [ERROR]   symbol:   class Task
17:37:39 [PREPARING] [ERROR]   location: class ToDoApp
17:37:39 [PREPARING] [ERROR] /git_2262367575734226142/src/main/java/ch/fhnw/prog1/exercise/todo/ToDoApp.java:[52,14] cannot find symbol
17:37:39 [PREPARING] [ERROR]   symbol:   class Task
17:37:39 [PREPARING] [ERROR]   location: class ToDoApp
17:37:39 [PREPARING] [ERROR] /git_2262367575734226142/src/main/java/ch/fhnw/prog1/exercise/todo/ToDoApp.java:[75,9] cannot find symbol
17:37:39 [PREPARING] [ERROR]   symbol:   class Task
17:37:39 [PREPARING] [ERROR]   location: class ToDoApp
17:37:39 [PREPARING] [ERROR] /git_2262367575734226142/src/main/java/ch/fhnw/prog1/exercise/todo/ToDoApp.java:[75,25] cannot find symbol
17:37:39 [PREPARING] [ERROR]   symbol:   class Task
17:37:39 [PREPARING] [ERROR]   location: class ToDoApp
17:37:39 [PREPARING] [ERROR] -> [Help 1]
17:37:39 [PREPARING] [ERROR]
17:37:39 [PREPARING] [ERROR] To see the full stack trace of the errors, re-run Maven with the -e switch.
17:37:39 [PREPARING] [ERROR] Re-run Maven using the -X switch to enable full debug logging.
17:37:39 [PREPARING] [ERROR]
17:37:39 [PREPARING] [ERROR] For more information about the errors and possible solutions, please read the following articles:
17:37:39 [PREPARING] [ERROR] [Help 1] http://cwiki.apache.org/confluence/display/MAVEN/MojoFailureException
17:37:39 [PREPARING] Failed to build student submission
17:37:39 [PREPARING]     HINT: ensure your code can be compiled locally before running AutoFeedback evaluation