12:12:22 [PREPARING] [INFO] Scanning for projects...
12:12:23 [PREPARING] [INFO]
12:12:23 [PREPARING] [INFO] -----------------------< prog1:objects-classes >------------------------
12:12:23 [PREPARING] [INFO] Building objects-classes 1.0-SNAPSHOT
12:12:23 [PREPARING] [INFO] from pom.xml
12:12:23 [PREPARING] [INFO] --------------------------------[ jar ]---------------------------------
12:12:33 [PREPARING] [INFO]
12:12:33 [PREPARING] [INFO] --- clean:3.2.0:clean (default-clean) @ objects-classes ---
12:12:34 [PREPARING] [INFO]
12:12:34 [PREPARING] [INFO] --- resources:3.4.0:resources (default-resources) @ objects-classes ---
12:12:35 [PREPARING] [INFO] skip non existing resourceDirectory /git_11972458402317567667/src/main/resources
12:12:35 [PREPARING] [INFO]
12:12:35 [PREPARING] [INFO] --- compiler:3.15.0:compile (default-compile) @ objects-classes ---
12:12:36 [PREPARING] [INFO] Recompiling the module because of changed source code.
12:12:36 [PREPARING] [INFO] Compiling 5 source files with javac [debug release 25] to target/classes
12:12:37 [PREPARING] [INFO] -------------------------------------------------------------
12:12:37 [PREPARING] [ERROR] COMPILATION ERROR :
12:12:37 [PREPARING] [INFO] -------------------------------------------------------------
12:12:37 [PREPARING] [ERROR] /git_11972458402317567667/src/main/java/ch/fhnw/prog1/exercise/stepstats/StepTracker.java:[20,31] cannot find symbol
12:12:37 [PREPARING] symbol: method computeStatistics(int[],int)
12:12:37 [PREPARING] location: class ch.fhnw.prog1.exercise.stepstats.StepStatistics
12:12:37 [PREPARING] [INFO] 1 error
12:12:37 [PREPARING] [INFO] -------------------------------------------------------------
12:12:37 [PREPARING] [INFO] ------------------------------------------------------------------------
12:12:37 [PREPARING] [INFO] BUILD FAILURE
12:12:37 [PREPARING] [INFO] ------------------------------------------------------------------------
12:12:37 [PREPARING] [INFO] Total time: 14.556 s
12:12:37 [PREPARING] [INFO] Finished at: 2026-09-29T12:12:37Z
12:12:37 [PREPARING] [INFO] ------------------------------------------------------------------------
12:12:37 [PREPARING] [ERROR] Failed to execute goal org.apache.maven.plugins:maven-compiler-plugin:3.15.0:compile (default-compile) on project objects-classes: Compilation failure
12:12:37 [PREPARING] [ERROR] /git_11972458402317567667/src/main/java/ch/fhnw/prog1/exercise/stepstats/StepTracker.java:[20,31] cannot find symbol
12:12:37 [PREPARING] [ERROR] symbol: method computeStatistics(int[],int)
12:12:37 [PREPARING] [ERROR] location: class ch.fhnw.prog1.exercise.stepstats.StepStatistics
12:12:37 [PREPARING] [ERROR]
12:12:37 [PREPARING] [ERROR] -> [Help 1]
12:12:37 [PREPARING] [ERROR]
12:12:37 [PREPARING] [ERROR] To see the full stack trace of the errors, re-run Maven with the -e switch.
12:12:37 [PREPARING] [ERROR] Re-run Maven using the -X switch to enable full debug logging.
12:12:37 [PREPARING] [ERROR]
12:12:37 [PREPARING] [ERROR] For more information about the errors and possible solutions, please read the following articles:
12:12:37 [PREPARING] [ERROR] [Help 1] http://cwiki.apache.org/confluence/display/MAVEN/MojoFailureException
12:12:37 [PREPARING] Failed to build student submission
12:12:37 [PREPARING] HINT: ensure your code can be compiled locally before running AutoFeedback evaluation