09:39:38 [PREPARING] [INFO] Scanning for projects...
09:39:39 [PREPARING] [INFO]
09:39:39 [PREPARING] [INFO] -----------------------< prog1:objects-classes >------------------------
09:39:39 [PREPARING] [INFO] Building objects-classes 1.0-SNAPSHOT
09:39:39 [PREPARING] [INFO] from pom.xml
09:39:39 [PREPARING] [INFO] --------------------------------[ jar ]---------------------------------
09:39:50 [PREPARING] [INFO]
09:39:50 [PREPARING] [INFO] --- clean:3.2.0:clean (default-clean) @ objects-classes ---
09:39:51 [PREPARING] [INFO]
09:39:51 [PREPARING] [INFO] --- resources:3.4.0:resources (default-resources) @ objects-classes ---
09:39:52 [PREPARING] [INFO] skip non existing resourceDirectory /git_15184062925998957846/src/main/resources
09:39:52 [PREPARING] [INFO]
09:39:52 [PREPARING] [INFO] --- compiler:3.15.0:compile (default-compile) @ objects-classes ---
09:39:53 [PREPARING] [INFO] Recompiling the module because of changed source code.
09:39:53 [PREPARING] [INFO] Compiling 5 source files with javac [debug release 25] to target/classes
09:39:55 [PREPARING] [INFO]
09:39:55 [PREPARING] [INFO] --- resources:3.4.0:resources (default-resources) @ objects-classes ---
09:39:55 [PREPARING] [INFO] skip non existing resourceDirectory /git_15184062925998957846/src/main/resources
09:39:55 [PREPARING] [INFO]
09:39:55 [PREPARING] [INFO] --- compiler:3.15.0:compile (default-compile) @ objects-classes ---
09:39:55 [PREPARING] [INFO] Recompiling the module because of changed source code.
09:39:55 [PREPARING] [INFO] Compiling 5 source files with javac [debug release 25] to target/classes
09:39:55 [PREPARING] [INFO]
09:39:55 [PREPARING] [INFO] --- resources:3.4.0:testResources (default-testResources) @ objects-classes ---
09:39:55 [PREPARING] [INFO] skip non existing resourceDirectory /git_15184062925998957846/src/test/resources
09:39:55 [PREPARING] [INFO]
09:39:55 [PREPARING] [INFO] --- compiler:3.15.0:testCompile (default-testCompile) @ objects-classes ---
09:39:55 [PREPARING] [INFO] Recompiling the module because of changed dependency.
09:39:55 [PREPARING] [INFO] Compiling 1 source file with javac [debug release 25] to target/test-classes
09:39:56 [PREPARING] [INFO] -------------------------------------------------------------
09:39:56 [PREPARING] [ERROR] COMPILATION ERROR :
09:39:56 [PREPARING] [INFO] -------------------------------------------------------------
09:39:56 [PREPARING] [ERROR] /git_15184062925998957846/src/test/java/ch/fhnw/prog1/exercise/energymeter/EnergyMeterTest.java:[18,29] constructor EnergyMeter in class ch.fhnw.prog1.exercise.energymeter.EnergyMeter cannot be applied to given types;
09:39:56 [PREPARING] required: no arguments
09:39:56 [PREPARING] found: int
09:39:56 [PREPARING] reason: actual and formal argument lists differ in length
09:39:56 [PREPARING] [ERROR] /git_15184062925998957846/src/test/java/ch/fhnw/prog1/exercise/energymeter/EnergyMeterTest.java:[19,32] cannot find symbol
09:39:56 [PREPARING] symbol: variable capacity
09:39:56 [PREPARING] location: variable meter of type ch.fhnw.prog1.exercise.energymeter.EnergyMeter
09:39:56 [PREPARING] [ERROR] /git_15184062925998957846/src/test/java/ch/fhnw/prog1/exercise/energymeter/EnergyMeterTest.java:[20,30] cannot find symbol
09:39:56 [PREPARING] symbol: variable level
09:39:56 [PREPARING] location: variable meter of type ch.fhnw.prog1.exercise.energymeter.EnergyMeter
09:39:56 [PREPARING] [ERROR] /git_15184062925998957846/src/test/java/ch/fhnw/prog1/exercise/energymeter/EnergyMeterTest.java:[22,17] constructor EnergyMeter in class ch.fhnw.prog1.exercise.energymeter.EnergyMeter cannot be applied to given types;
09:39:56 [PREPARING] required: no arguments
09:39:56 [PREPARING] found: double
09:39:56 [PREPARING] reason: actual and formal argument lists differ in length
09:39:56 [PREPARING] [ERROR] /git_15184062925998957846/src/test/java/ch/fhnw/prog1/exercise/energymeter/EnergyMeterTest.java:[23,33] cannot find symbol
09:39:56 [PREPARING] symbol: variable capacity
09:39:56 [PREPARING] location: variable meter of type ch.fhnw.prog1.exercise.energymeter.EnergyMeter
09:39:56 [PREPARING] [ERROR] /git_15184062925998957846/src/test/java/ch/fhnw/prog1/exercise/energymeter/EnergyMeterTest.java:[24,30] cannot find symbol
09:39:56 [PREPARING] symbol: variable level
09:39:56 [PREPARING] location: variable meter of type ch.fhnw.prog1.exercise.energymeter.EnergyMeter
09:39:56 [PREPARING] [ERROR] /git_15184062925998957846/src/test/java/ch/fhnw/prog1/exercise/energymeter/EnergyMeterTest.java:[31,13] constructor EnergyMeter in class ch.fhnw.prog1.exercise.energymeter.EnergyMeter cannot be applied to given types;
09:39:56 [PREPARING] required: no arguments
09:39:56 [PREPARING] found: int
09:39:56 [PREPARING] reason: actual and formal argument lists differ in length
09:39:56 [PREPARING] [ERROR] /git_15184062925998957846/src/test/java/ch/fhnw/prog1/exercise/energymeter/EnergyMeterTest.java:[34,13] constructor EnergyMeter in class ch.fhnw.prog1.exercise.energymeter.EnergyMeter cannot be applied to given types;
09:39:56 [PREPARING] required: no arguments
09:39:56 [PREPARING] found: double
09:39:56 [PREPARING] reason: actual and formal argument lists differ in length
09:39:56 [PREPARING] [ERROR] /git_15184062925998957846/src/test/java/ch/fhnw/prog1/exercise/energymeter/EnergyMeterTest.java:[37,13] constructor EnergyMeter in class ch.fhnw.prog1.exercise.energymeter.EnergyMeter cannot be applied to given types;
09:39:56 [PREPARING] required: no arguments
09:39:56 [PREPARING] found: double
09:39:56 [PREPARING] reason: actual and formal argument lists differ in length
09:39:56 [PREPARING] [ERROR] /git_15184062925998957846/src/test/java/ch/fhnw/prog1/exercise/energymeter/EnergyMeterTest.java:[41,13] constructor EnergyMeter in class ch.fhnw.prog1.exercise.energymeter.EnergyMeter cannot be applied to given types;
09:39:56 [PREPARING] required: no arguments
09:39:56 [PREPARING] found: int
09:39:56 [PREPARING] reason: actual and formal argument lists differ in length
09:39:56 [PREPARING] [ERROR] /git_15184062925998957846/src/test/java/ch/fhnw/prog1/exercise/energymeter/EnergyMeterTest.java:[48,29] constructor EnergyMeter in class ch.fhnw.prog1.exercise.energymeter.EnergyMeter cannot be applied to given types;
09:39:56 [PREPARING] required: no arguments
09:39:56 [PREPARING] found: int
09:39:56 [PREPARING] reason: actual and formal argument lists differ in length
09:39:56 [PREPARING] [ERROR] /git_15184062925998957846/src/test/java/ch/fhnw/prog1/exercise/energymeter/EnergyMeterTest.java:[49,14] cannot find symbol
09:39:56 [PREPARING] symbol: method fill(int)
09:39:56 [PREPARING] location: variable meter of type ch.fhnw.prog1.exercise.energymeter.EnergyMeter
09:39:56 [PREPARING] [ERROR] /git_15184062925998957846/src/test/java/ch/fhnw/prog1/exercise/energymeter/EnergyMeterTest.java:[50,31] cannot find symbol
09:39:56 [PREPARING] symbol: variable level
09:39:56 [PREPARING] location: variable meter of type ch.fhnw.prog1.exercise.energymeter.EnergyMeter
09:39:56 [PREPARING] [ERROR] /git_15184062925998957846/src/test/java/ch/fhnw/prog1/exercise/energymeter/EnergyMeterTest.java:[52,14] cannot find symbol
09:39:56 [PREPARING] symbol: method fill(double)
09:39:56 [PREPARING] location: variable meter of type ch.fhnw.prog1.exercise.energymeter.EnergyMeter
09:39:56 [PREPARING] [ERROR] /git_15184062925998957846/src/test/java/ch/fhnw/prog1/exercise/energymeter/EnergyMeterTest.java:[53,33] cannot find symbol
09:39:56 [PREPARING] symbol: variable level
09:39:56 [PREPARING] location: variable meter of type ch.fhnw.prog1.exercise.energymeter.EnergyMeter
09:39:56 [PREPARING] [ERROR] /git_15184062925998957846/src/test/java/ch/fhnw/prog1/exercise/energymeter/EnergyMeterTest.java:[55,14] cannot find symbol
09:39:56 [PREPARING] symbol: method fill(double)
09:39:56 [PREPARING] location: variable meter of type ch.fhnw.prog1.exercise.energymeter.EnergyMeter
09:39:56 [PREPARING] [ERROR] /git_15184062925998957846/src/test/java/ch/fhnw/prog1/exercise/energymeter/EnergyMeterTest.java:[56,32] cannot find symbol
09:39:56 [PREPARING] symbol: variable level
09:39:56 [PREPARING] location: variable meter of type ch.fhnw.prog1.exercise.energymeter.EnergyMeter
09:39:56 [PREPARING] [ERROR] /git_15184062925998957846/src/test/java/ch/fhnw/prog1/exercise/energymeter/EnergyMeterTest.java:[62,29] constructor EnergyMeter in class ch.fhnw.prog1.exercise.energymeter.EnergyMeter cannot be applied to given types;
09:39:56 [PREPARING] required: no arguments
09:39:56 [PREPARING] found: int
09:39:56 [PREPARING] reason: actual and formal argument lists differ in length
09:39:56 [PREPARING] [ERROR] /git_15184062925998957846/src/test/java/ch/fhnw/prog1/exercise/energymeter/EnergyMeterTest.java:[64,18] cannot find symbol
09:39:56 [PREPARING] symbol: method fill(int)
09:39:56 [PREPARING] location: variable meter of type ch.fhnw.prog1.exercise.energymeter.EnergyMeter
09:39:56 [PREPARING] [ERROR] /git_15184062925998957846/src/test/java/ch/fhnw/prog1/exercise/energymeter/EnergyMeterTest.java:[67,18] cannot find symbol
09:39:56 [PREPARING] symbol: method fill(double)
09:39:56 [PREPARING] location: variable meter of type ch.fhnw.prog1.exercise.energymeter.EnergyMeter
09:39:56 [PREPARING] [ERROR] /git_15184062925998957846/src/test/java/ch/fhnw/prog1/exercise/energymeter/EnergyMeterTest.java:[71,18] cannot find symbol
09:39:56 [PREPARING] symbol: method fill(int)
09:39:56 [PREPARING] location: variable meter of type ch.fhnw.prog1.exercise.energymeter.EnergyMeter
09:39:56 [PREPARING] [ERROR] /git_15184062925998957846/src/test/java/ch/fhnw/prog1/exercise/energymeter/EnergyMeterTest.java:[78,29] constructor EnergyMeter in class ch.fhnw.prog1.exercise.energymeter.EnergyMeter cannot be applied to given types;
09:39:56 [PREPARING] required: no arguments
09:39:56 [PREPARING] found: int
09:39:56 [PREPARING] reason: actual and formal argument lists differ in length
09:39:56 [PREPARING] [ERROR] /git_15184062925998957846/src/test/java/ch/fhnw/prog1/exercise/energymeter/EnergyMeterTest.java:[79,14] cannot find symbol
09:39:56 [PREPARING] symbol: method fill(int)
09:39:56 [PREPARING] location: variable meter of type ch.fhnw.prog1.exercise.energymeter.EnergyMeter
09:39:56 [PREPARING] [ERROR] /git_15184062925998957846/src/test/java/ch/fhnw/prog1/exercise/energymeter/EnergyMeterTest.java:[80,31] cannot find symbol
09:39:56 [PREPARING] symbol: variable level
09:39:56 [PREPARING] location: variable meter of type ch.fhnw.prog1.exercise.energymeter.EnergyMeter
09:39:56 [PREPARING] [ERROR] /git_15184062925998957846/src/test/java/ch/fhnw/prog1/exercise/energymeter/EnergyMeterTest.java:[82,14] cannot find symbol
09:39:56 [PREPARING] symbol: method fill(int)
09:39:56 [PREPARING] location: variable meter of type ch.fhnw.prog1.exercise.energymeter.EnergyMeter
09:39:56 [PREPARING] [ERROR] /git_15184062925998957846/src/test/java/ch/fhnw
09:39:56 [PREPARING] /prog1/exercise/energymeter/EnergyMeterTest.java:[83,31] cannot find symbol
09:39:56 [PREPARING] symbol: variable level
09:39:56 [PREPARING] location: variable meter of type ch.fhnw.prog1.exercise.energymeter.EnergyMeter
09:39:56 [PREPARING] [ERROR] /git_15184062925998957846/src/test/java/ch/fhnw/prog1/exercise/energymeter/EnergyMeterTest.java:[85,14] cannot find symbol
09:39:56 [PREPARING] symbol: method fill(double)
09:39:56 [PREPARING] location: variable meter of type ch.fhnw.prog1.exercise.energymeter.EnergyMeter
09:39:56 [PREPARING] [ERROR] /git_15184062925998957846/src/test/java/ch/fhnw/prog1/exercise/energymeter/EnergyMeterTest.java:[86,31] cannot find symbol
09:39:56 [PREPARING] symbol: variable level
09:39:56 [PREPARING] location: variable meter of type ch.fhnw.prog1.exercise.energymeter.EnergyMeter
09:39:56 [PREPARING] [ERROR] /git_15184062925998957846/src/test/java/ch/fhnw/prog1/exercise/energymeter/EnergyMeterTest.java:[92,29] constructor EnergyMeter in class ch.fhnw.prog1.exercise.energymeter.EnergyMeter cannot be applied to given types;
09:39:56 [PREPARING] required: no arguments
09:39:56 [PREPARING] found: int
09:39:56 [PREPARING] reason: actual and formal argument lists differ in length
09:39:56 [PREPARING] [ERROR] /git_15184062925998957846/src/test/java/ch/fhnw/prog1/exercise/energymeter/EnergyMeterTest.java:[93,14] cannot find symbol
09:39:56 [PREPARING] symbol: method fill(int)
09:39:56 [PREPARING] location: variable meter of type ch.fhnw.prog1.exercise.energymeter.EnergyMeter
09:39:56 [PREPARING] [ERROR] /git_15184062925998957846/src/test/java/ch/fhnw/prog1/exercise/energymeter/EnergyMeterTest.java:[94,14] cannot find symbol
09:39:56 [PREPARING] symbol: method consume(int,int)
09:39:56 [PREPARING] location: variable meter of type ch.fhnw.prog1.exercise.energymeter.EnergyMeter
09:39:56 [PREPARING] [ERROR] /git_15184062925998957846/src/test/java/ch/fhnw/prog1/exercise/energymeter/EnergyMeterTest.java:[95,31] cannot find symbol
09:39:56 [PREPARING] symbol: variable level
09:39:56 [PREPARING] location: variable meter of type ch.fhnw.prog1.exercise.energymeter.EnergyMeter
09:39:56 [PREPARING] [ERROR] /git_15184062925998957846/src/test/java/ch/fhnw/prog1/exercise/energymeter/EnergyMeterTest.java:[97,14] cannot find symbol
09:39:56 [PREPARING] symbol: method consume(double,int)
09:39:56 [PREPARING] location: variable meter of type ch.fhnw.prog1.exercise.energymeter.EnergyMeter
09:39:56 [PREPARING] [ERROR] /git_15184062925998957846/src/test/java/ch/fhnw/prog1/exercise/energymeter/EnergyMeterTest.java:[98,31] cannot find symbol
09:39:56 [PREPARING] symbol: variable level
09:39:56 [PREPARING] location: variable meter of type ch.fhnw.prog1.exercise.energymeter.EnergyMeter
09:39:56 [PREPARING] [ERROR] /git_15184062925998957846/src/test/java/ch/fhnw/prog1/exercise/energymeter/EnergyMeterTest.java:[100,14] cannot find symbol
09:39:56 [PREPARING] symbol: method consume(int,double)
09:39:56 [PREPARING] location: variable meter of type ch.fhnw.prog1.exercise.energymeter.EnergyMeter
09:39:56 [PREPARING] [ERROR] /git_15184062925998957846/src/test/java/ch/fhnw/prog1/exercise/energymeter/EnergyMeterTest.java:[101,31] cannot find symbol
09:39:56 [PREPARING] symbol: variable level
09:39:56 [PREPARING] location: variable meter of type ch.fhnw.prog1.exercise.energymeter.EnergyMeter
09:39:56 [PREPARING] [ERROR] /git_15184062925998957846/src/test/java/ch/fhnw/prog1/exercise/energymeter/EnergyMeterTest.java:[103,14] cannot find symbol
09:39:56 [PREPARING] symbol: method consume(int,int)
09:39:56 [PREPARING] location: variable meter of type ch.fhnw.prog1.exercise.energymeter.EnergyMeter
09:39:56 [PREPARING] [ERROR] /git_15184062925998957846/src/test/java/ch/fhnw/prog1/exercise/energymeter/EnergyMeterTest.java:[104,30] cannot find symbol
09:39:56 [PREPARING] symbol: variable level
09:39:56 [PREPARING] location: variable meter of type ch.fhnw.prog1.exercise.energymeter.EnergyMeter
09:39:56 [PREPARING] [ERROR] /git_15184062925998957846/src/test/java/ch/fhnw/prog1/exercise/energymeter/EnergyMeterTest.java:[110,29] constructor EnergyMeter in class ch.fhnw.prog1.exercise.energymeter.EnergyMeter cannot be applied to given types;
09:39:56 [PREPARING] required: no arguments
09:39:56 [PREPARING] found: int
09:39:56 [PREPARING] reason: actual and formal argument lists differ in length
09:39:56 [PREPARING] [ERROR] /git_15184062925998957846/src/test/java/ch/fhnw/prog1/exercise/energymeter/EnergyMeterTest.java:[112,18] cannot find symbol
09:39:56 [PREPARING] symbol: method consume(int,int)
09:39:56 [PREPARING] location: variable meter of type ch.fhnw.prog1.exercise.energymeter.EnergyMeter
09:39:56 [PREPARING] [ERROR] /git_15184062925998957846/src/test/java/ch/fhnw/prog1/exercise/energymeter/EnergyMeterTest.java:[115,18] cannot find symbol
09:39:56 [PREPARING] symbol: method consume(double,int)
09:39:56 [PREPARING] location: variable meter of type ch.fhnw.prog1.exercise.energymeter.EnergyMeter
09:39:57 [PREPARING] [ERROR] /git_15184062925998957846/src/test/java/ch/fhnw/prog1/exercise/energymeter/EnergyMeterTest.java:[118,18] cannot find symbol
09:39:57 [PREPARING] symbol: method consume(int,int)
09:39:57 [PREPARING] location: variable meter of type ch.fhnw.prog1.exercise.energymeter.EnergyMeter
09:39:57 [PREPARING] [ERROR] /git_15184062925998957846/src/test/java/ch/fhnw/prog1/exercise/energymeter/EnergyMeterTest.java:[121,18] cannot find symbol
09:39:57 [PREPARING] symbol: method consume(int,double)
09:39:57 [PREPARING] location: variable meter of type ch.fhnw.prog1.exercise.energymeter.EnergyMeter
09:39:57 [PREPARING] [ERROR] /git_15184062925998957846/src/test/java/ch/fhnw/prog1/exercise/energymeter/EnergyMeterTest.java:[124,18] cannot find symbol
09:39:57 [PREPARING] symbol: method consume(int,int)
09:39:57 [PREPARING] location: variable meter of type ch.fhnw.prog1.exercise.energymeter.EnergyMeter
09:39:57 [PREPARING] [ERROR] /git_15184062925998957846/src/test/java/ch/fhnw/prog1/exercise/energymeter/EnergyMeterTest.java:[128,18] cannot find symbol
09:39:57 [PREPARING] symbol: method consume(int,int)
09:39:57 [PREPARING] location: variable meter of type ch.fhnw.prog1.exercise.energymeter.EnergyMeter
09:39:57 [PREPARING] [ERROR] /git_15184062925998957846/src/test/java/ch/fhnw/prog1/exercise/energymeter/EnergyMeterTest.java:[131,18] cannot find symbol
09:39:57 [PREPARING] symbol: method consume(int,int)
09:39:57 [PREPARING] location: variable meter of type ch.fhnw.prog1.exercise.energymeter.EnergyMeter
09:39:57 [PREPARING] [ERROR] /git_15184062925998957846/src/test/java/ch/fhnw/prog1/exercise/energymeter/EnergyMeterTest.java:[134,18] cannot find symbol
09:39:57 [PREPARING] symbol: method consume(int,int)
09:39:57 [PREPARING] location: variable meter of type ch.fhnw.prog1.exercise.energymeter.EnergyMeter
09:39:57 [PREPARING] [ERROR] /git_15184062925998957846/src/test/java/ch/fhnw/prog1/exercise/energymeter/EnergyMeterTest.java:[141,29] constructor EnergyMeter in class ch.fhnw.prog1.exercise.energymeter.EnergyMeter cannot be applied to given types;
09:39:57 [PREPARING] required: no arguments
09:39:57 [PREPARING] found: int
09:39:57 [PREPARING] reason: actual and formal argument lists differ in length
09:39:57 [PREPARING] [ERROR] /git_15184062925998957846/src/test/java/ch/fhnw/prog1/exercise/energymeter/EnergyMeterTest.java:[142,14] cannot find symbol
09:39:57 [PREPARING] symbol: method fill(int)
09:39:57 [PREPARING] location: variable meter of type ch.fhnw.prog1.exercise.energymeter.EnergyMeter
09:39:57 [PREPARING] [ERROR] /git_15184062925998957846/src/test/java/ch/fhnw/prog1/exercise/energymeter/EnergyMeterTest.java:[143,14] cannot find symbol
09:39:57 [PREPARING] symbol: method consume(int,int)
09:39:57 [PREPARING] location: variable meter of type ch.fhnw.prog1.exercise.energymeter.EnergyMeter
09:39:57 [PREPARING] [ERROR] /git_15184062925998957846/src/test/java/ch/fhnw/prog1/exercise/energymeter/EnergyMeterTest.java:[144,30] cannot find symbol
09:39:57 [PREPARING] symbol: variable level
09:39:57 [PREPARING] location: variable meter of type ch.fhnw.prog1.exercise.energymeter.EnergyMeter
09:39:57 [PREPARING] [ERROR] /git_15184062925998957846/src/test/java/ch/fhnw/prog1/exercise/energymeter/EnergyMeterTest.java:[146,14] cannot find symbol
09:39:57 [PREPARING] symbol: method consume(double,double)
09:39:57 [PREPARING] location: variable meter of type ch.fhnw.prog1.exercise.energymeter.EnergyMeter
09:39:57 [PREPARING] [ERROR] /git_15184062925998957846/src/test/java/ch/fhnw/prog1/exercise/energymeter/EnergyMeterTest.java:[147,30] cannot find symbol
09:39:57 [PREPARING] symbol: v
09:39:57 [PREPARING] ariable level
09:39:57 [PREPARING] location: variable meter of type ch.fhnw.prog1.exercise.energymeter.EnergyMeter
09:39:57 [PREPARING] [ERROR] /git_15184062925998957846/src/test/java/ch/fhnw/prog1/exercise/energymeter/EnergyMeterTest.java:[153,29] constructor EnergyMeter in class ch.fhnw.prog1.exercise.energymeter.EnergyMeter cannot be applied to given types;
09:39:57 [PREPARING] required: no arguments
09:39:57 [PREPARING] found: int
09:39:57 [PREPARING] reason: actual and formal argument lists differ in length
09:39:57 [PREPARING] [ERROR] /git_15184062925998957846/src/test/java/ch/fhnw/prog1/exercise/energymeter/EnergyMeterTest.java:[154,30] cannot find symbol
09:39:57 [PREPARING] symbol: method percentFull()
09:39:57 [PREPARING] location: variable meter of type ch.fhnw.prog1.exercise.energymeter.EnergyMeter
09:39:57 [PREPARING] [ERROR] /git_15184062925998957846/src/test/java/ch/fhnw/prog1/exercise/energymeter/EnergyMeterTest.java:[156,14] cannot find symbol
09:39:57 [PREPARING] symbol: method fill(int)
09:39:57 [PREPARING] location: variable meter of type ch.fhnw.prog1.exercise.energymeter.EnergyMeter
09:39:57 [PREPARING] [ERROR] /git_15184062925998957846/src/test/java/ch/fhnw/prog1/exercise/energymeter/EnergyMeterTest.java:[157,31] cannot find symbol
09:39:57 [PREPARING] symbol: method percentFull()
09:39:57 [PREPARING] location: variable meter of type ch.fhnw.prog1.exercise.energymeter.EnergyMeter
09:39:57 [PREPARING] [ERROR] /git_15184062925998957846/src/test/java/ch/fhnw/prog1/exercise/energymeter/EnergyMeterTest.java:[159,14] cannot find symbol
09:39:57 [PREPARING] symbol: method fill(int)
09:39:57 [PREPARING] location: variable meter of type ch.fhnw.prog1.exercise.energymeter.EnergyMeter
09:39:57 [PREPARING] [ERROR] /git_15184062925998957846/src/test/java/ch/fhnw/prog1/exercise/energymeter/EnergyMeterTest.java:[160,33] cannot find symbol
09:39:57 [PREPARING] symbol: method percentFull()
09:39:57 [PREPARING] location: variable meter of type ch.fhnw.prog1.exercise.energymeter.EnergyMeter
09:39:57 [PREPARING] [ERROR] /git_15184062925998957846/src/test/java/ch/fhnw/prog1/exercise/energymeter/EnergyMeterTest.java:[162,14] cannot find symbol
09:39:57 [PREPARING] symbol: method fill(int)
09:39:57 [PREPARING] location: variable meter of type ch.fhnw.prog1.exercise.energymeter.EnergyMeter
09:39:57 [PREPARING] [ERROR] /git_15184062925998957846/src/test/java/ch/fhnw/prog1/exercise/energymeter/EnergyMeterTest.java:[163,32] cannot find symbol
09:39:57 [PREPARING] symbol: method percentFull()
09:39:57 [PREPARING] location: variable meter of type ch.fhnw.prog1.exercise.energymeter.EnergyMeter
09:39:57 [PREPARING] [ERROR] /git_15184062925998957846/src/test/java/ch/fhnw/prog1/exercise/energymeter/EnergyMeterTest.java:[169,29] constructor EnergyMeter in class ch.fhnw.prog1.exercise.energymeter.EnergyMeter cannot be applied to given types;
09:39:57 [PREPARING] required: no arguments
09:39:57 [PREPARING] found: int
09:39:57 [PREPARING] reason: actual and formal argument lists differ in length
09:39:57 [PREPARING] [ERROR] /git_15184062925998957846/src/test/java/ch/fhnw/prog1/exercise/energymeter/EnergyMeterTest.java:[170,32] cannot find symbol
09:39:57 [PREPARING] symbol: method percentFull()
09:39:57 [PREPARING] location: variable meter of type ch.fhnw.prog1.exercise.energymeter.EnergyMeter
09:39:57 [PREPARING] [ERROR] /git_15184062925998957846/src/test/java/ch/fhnw/prog1/exercise/energymeter/EnergyMeterTest.java:[171,14] cannot find symbol
09:39:57 [PREPARING] symbol: method fill(int)
09:39:57 [PREPARING] location: variable meter of type ch.fhnw.prog1.exercise.energymeter.EnergyMeter
09:39:57 [PREPARING] [ERROR] /git_15184062925998957846/src/test/java/ch/fhnw/prog1/exercise/energymeter/EnergyMeterTest.java:[172,32] cannot find symbol
09:39:57 [PREPARING] symbol: method percentFull()
09:39:57 [PREPARING] location: variable meter of type ch.fhnw.prog1.exercise.energymeter.EnergyMeter
09:39:57 [PREPARING] [ERROR] /git_15184062925998957846/src/test/java/ch/fhnw/prog1/exercise/energymeter/EnergyMeterTest.java:[173,14] cannot find symbol
09:39:57 [PREPARING] symbol: method consume(int,int)
09:39:57 [PREPARING] location: variable meter of type ch.fhnw.prog1.exercise.energymeter.EnergyMeter
09:39:57 [PREPARING] [ERROR] /git_15184062925998957846/src/test/java/ch/fhnw/prog1/exercise/energymeter/EnergyMeterTest.java:[174,32] cannot find symbol
09:39:57 [PREPARING] symbol: method percentFull()
09:39:57 [PREPARING] location: variable meter of type ch.fhnw.prog1.exercise.energymeter.EnergyMeter
09:39:57 [PREPARING] [INFO] 67 errors
09:39:57 [PREPARING] [INFO] -------------------------------------------------------------
09:39:57 [PREPARING] [INFO] ------------------------------------------------------------------------
09:39:57 [PREPARING] [INFO] BUILD FAILURE
09:39:57 [PREPARING] [INFO] ------------------------------------------------------------------------
09:39:57 [PREPARING] [INFO] Total time: 17.871 s
09:39:57 [PREPARING] [INFO] Finished at: 2026-09-28T09:39:56Z
09:39:57 [PREPARING] [INFO] ------------------------------------------------------------------------
09:39:57 [PREPARING] [ERROR] Failed to execute goal org.apache.maven.plugins:maven-compiler-plugin:3.15.0:testCompile (default-testCompile) on project objects-classes: Compilation failure: Compilation failure:
09:39:57 [PREPARING] [ERROR] /git_15184062925998957846/src/test/java/ch/fhnw/prog1/exercise/energymeter/EnergyMeterTest.java:[18,29] constructor EnergyMeter in class ch.fhnw.prog1.exercise.energymeter.EnergyMeter cannot be applied to given types;
09:39:57 [PREPARING] [ERROR] required: no arguments
09:39:57 [PREPARING] [ERROR] found: int
09:39:57 [PREPARING] [ERROR] reason: actual and formal argument lists differ in length
09:39:57 [PREPARING] [ERROR] /git_15184062925998957846/src/test/java/ch/fhnw/prog1/exercise/energymeter/EnergyMeterTest.java:[19,32] cannot find symbol
09:39:57 [PREPARING] [ERROR] symbol: variable capacity
09:39:57 [PREPARING] [ERROR] location: variable meter of type ch.fhnw.prog1.exercise.energymeter.EnergyMeter
09:39:57 [PREPARING] [ERROR] /git_15184062925998957846/src/test/java/ch/fhnw/prog1/exercise/energymeter/EnergyMeterTest.java:[20,30] cannot find symbol
09:39:57 [PREPARING] [ERROR] symbol: variable level
09:39:57 [PREPARING] [ERROR] location: variable meter of type ch.fhnw.prog1.exercise.energymeter.EnergyMeter
09:39:57 [PREPARING] [ERROR] /git_15184062925998957846/src/test/java/ch/fhnw/prog1/exercise/energymeter/EnergyMeterTest.java:[22,17] constructor EnergyMeter in class ch.fhnw.prog1.exercise.energymeter.EnergyMeter cannot be applied to given types;
09:39:57 [PREPARING] [ERROR] required: no arguments
09:39:57 [PREPARING] [ERROR] found: double
09:39:57 [PREPARING] [ERROR] reason: actual and formal argument lists differ in length
09:39:57 [PREPARING] [ERROR] /git_15184062925998957846/src/test/java/ch/fhnw/prog1/exercise/energymeter/EnergyMeterTest.java:[23,33] cannot find symbol
09:39:57 [PREPARING] [ERROR] symbol: variable capacity
09:39:57 [PREPARING] [ERROR] location: variable meter of type ch.fhnw.prog1.exercise.energymeter.EnergyMeter
09:39:57 [PREPARING] [ERROR] /git_15184062925998957846/src/test/java/ch/fhnw/prog1/exercise/energymeter/EnergyMeterTest.java:[24,30] cannot find symbol
09:39:57 [PREPARING] [ERROR] symbol: variable level
09:39:57 [PREPARING] [ERROR] location: variable meter of type ch.fhnw.prog1.exercise.energymeter.EnergyMeter
09:39:57 [PREPARING] [ERROR] /git_15184062925998957846/src/test/java/ch/fhnw/prog1/exercise/energymeter/EnergyMeterTest.java:[31,13] constructor EnergyMeter in class ch.fhnw.prog1.exercise.energymeter.EnergyMeter cannot be applied to given types;
09:39:57 [PREPARING] [ERROR] required: no arguments
09:39:57 [PREPARING] [ERROR] found: int
09:39:57 [PREPARING] [ERROR] reason: actual and formal argument lists differ in length
09:39:57 [PREPARING] [ERROR] /git_15184062925998957846/src/test/java/ch/fhnw/prog1/exercise/energymeter/EnergyMeterTest.java:[34,13] constructor EnergyMeter in class ch.fhnw.prog1.exercise.energymeter.EnergyMeter cannot be applied to given types;
09:39:57 [PREPARING] [ERROR] required: no arguments
09:39:57 [PREPARING] [ERROR] found: double
09:39:57 [PREPARING] [ERROR] reason: actual and formal argument lists differ in length
09:39:57 [PREPARING] [ERROR] /git_15184062925998957846/src/test/java/ch/fhnw/prog1/exercise/energymeter/EnergyMeterTest.java:[37,13] constructor EnergyMeter in class ch.fhnw.prog1.exercise.energymeter.EnergyMeter cannot be applied to given types;
09:39:57 [PREPARING] [ERROR] required: no arguments
09:39:57 [PREPARING] [ERROR] found: double
09:39:57 [PREPARING] [ERROR] reason: actual and formal argument lists differ in length
09:39:57 [PREPARING] [ERROR] /git_15184062925998957846/src/test/java/ch/fhnw/prog1/exercise/energymeter/EnergyMeterTest.java:[41,13] constructor EnergyMeter in class ch.fhnw.prog1.exercise.energymeter.EnergyMeter cannot be applied to given types;
09:39:57 [PREPARING] [ERROR] required: no arguments
09:39:57 [PREPARING] [ERROR] found: int
09:39:57 [PREPARING] [ERROR] reason: actual and formal argument lists differ in length
09:39:57 [PREPARING] [ERROR] /git_15184062925998957846/src/test/java/ch/fhnw/prog1/exercise/energymeter/EnergyMeterTest.java:[48,29] constructor EnergyMeter in class ch.fhnw.prog1.exercise.energymeter.EnergyMeter cannot be applied to given types;
09:39:57 [PREPARING] [ERROR] required: no arguments
09:39:57 [PREPARING] [ERROR] found: int
09:39:57 [PREPARING] [ERROR] reason: actual and formal argument lists differ in length
09:39:57 [PREPARING] [ERROR] /git_15184062925998957846/src/test/java/ch/fhnw/prog1/exercise/energymeter/EnergyMeterTest.java:[49,14] cannot find symbol
09:39:57 [PREPARING] [ERROR] symbol: method fill(int)
09:39:57 [PREPARING] [ERROR] location: variable meter of type ch.fhnw.prog1.exercise.energymeter.EnergyMeter
09:39:57 [PREPARING] [ERROR] /git_15184062925998957846/src/test/java/ch/fhnw/prog1/exercise/energymeter/EnergyMeterTest.java:[50,31] cannot find symbol
09:39:57 [PREPARING] [ERROR] symbol: variable level
09:39:57 [PREPARING] [ERROR] location: variable meter of type ch.fhnw.prog1.exercise.energymeter.EnergyMeter
09:39:57 [PREPARING] [ERROR] /git_15184062925998957846/src/test/java/ch/fhnw/prog1/exercise/energymeter/EnergyMeterTest.java:[52,14] cannot find symbol
09:39:57 [PREPARING] [ERROR] symbol: method fill(double)
09:39:57 [PREPARING] [ERROR] location: variable meter of type ch.fhnw.prog1.exercise.energymeter.EnergyMeter
09:39:57 [PREPARING] [ERROR] /git_15184062925998957846/src/test/java/ch/fhnw/prog1/exercise/energymeter/EnergyMeterTest.java:[53,33] cannot find symbol
09:39:57 [PREPARING] [ERROR] symbol: variable level
09:39:57 [PREPARING] [ERROR] location: variable meter of type ch.fhnw.prog1.exercise.energymeter.EnergyMeter
09:39:57 [PREPARING] [ERROR] /git_15184062925998957846/src/test/java/ch/fhnw/prog1/exercise/energymeter/EnergyMeterTest.java:[55,14] cannot find symbol
09:39:57 [PREPARING] [ERROR] symbol: method fill(double)
09:39:57 [PREPARING] [ERROR] location: variable meter of type ch.fhnw.prog1.exercise.energymeter.EnergyMeter
09:39:57 [PREPARING] [ERROR] /git_15184062925998957846/src/test/java/ch/fhnw/prog1/exercise/energymeter/EnergyMeterTest.java:[56,32] cannot find symbol
09:39:57 [PREPARING] [ERROR] symbol: variable level
09:39:57 [PREPARING] [ERROR] location: variable meter of type ch.fhnw.prog1.exercise.energymeter.EnergyMeter
09:39:57 [PREPARING] [ERROR] /git_15184062925998957846/src/test/java/ch/fhnw/prog1/exercise/energymeter/EnergyMeterTest.java:[62,29] constructor EnergyMeter in class ch.fhnw.prog1.exercise.energymeter.EnergyMeter cannot be applied to given types;
09:39:57 [PREPARING] [ERROR] required: no arguments
09:39:57 [PREPARING] [ERROR] found: int
09:39:57 [PREPARING] [ERROR] reason: actual and formal argument lists differ in length
09:39:57 [PREPARING] [ERROR] /git_15184062925998957846/src/test/java/ch/fhnw/prog1/exercise/energymeter/EnergyMeterTest.java:[64,18] cannot find symbol
09:39:57 [PREPARING] [ERROR] symbol: method fill(int)
09:39:57 [PREPARING] [ERROR] location: variable meter of type ch.fhnw.prog1.exercise.energymeter.EnergyMeter
09:39:57 [PREPARING] [ERROR] /git_15184062925998957846/src/test/java/ch/fhnw/prog1/exercise/energymeter/EnergyMeterTest.java:[67,18] cannot find symbol
09:39:57 [PREPARING] [ERROR] symbol: method fill(double)
09:39:57 [PREPARING] [ERROR] location: variable meter of type ch.fhnw.prog1.exercise.energymeter.EnergyMeter
09:39:57 [PREPARING] [ERROR] /git_15184062925998957846/src/test/java/ch/fhnw/prog1/exercise/energymeter/EnergyMeterTest.java:[71,18] cannot find symbol
09:39:57 [PREPARING] [ERROR] symbol: method fill(int)
09:39:57 [PREPARING] [ERROR] location: variable meter of type ch.fhnw.prog1.exercise.energymeter.EnergyMeter
09:39:57 [PREPARING] [ERROR] /git_15184062925998957846/src/test/java/ch/fhnw/prog1/exercise/energymeter/EnergyMeterTest.java:[78,29] constructor EnergyMeter in class ch.fhnw.prog1.exercise.energymeter.EnergyMeter cannot be applied to given types;
09:39:57 [PREPARING] [ERROR] required: no arguments
09:39:57 [PREPARING] [ERROR] found: int
09:39:57 [PREPARING] [ERROR] reason: actual and formal argument lists differ in length
09:39:57 [PREPARING] [ERROR] /git_15184062925998957846/src/test/java/ch/fhnw/prog1/exercise/energymeter/EnergyMeterTest.java:[79,14] cannot find symbol
09:39:57 [PREPARING] [ERROR] symbol: method fill(int)
09:39:57 [PREPARING] [ERROR] location: variable meter of type ch.fhnw.prog1.exercise.energymeter.EnergyMeter
09:39:57 [PREPARING] [ERROR] /git_15184062925998957846/src/test/java/ch/fhnw/prog1/exercise/energymeter/EnergyMeterTest.java:[80,31] cannot find symbol
09:39:57 [PREPARING] [ERROR] symbol: variable level
09:39:57 [PREPARING] [ERROR] location: variable meter of type ch.fhnw.prog1.exercise.energymeter.EnergyMeter
09:39:57 [PREPARING] [ERROR] /git_15184062925998957846/src/test/java/ch/fhnw/prog1/exercise/energymeter/EnergyMeterTest.java:[82,14] cannot find symbol
09:39:57 [PREPARING] [ERROR] symbol: method fill(int)
09:39:57 [PREPARING] [ERROR] location: variable meter of type ch.fhnw.prog1.exercise.energymeter.EnergyMeter
09:39:57 [PREPARING] [ERROR] /git_15184062925998957846/src/test/java/ch/fhnw/prog1/exercise/energymeter/EnergyMeterTest.java:[83,31] cannot find symbol
09:39:57 [PREPARING] [ERROR] symbol: variable level
09:39:57 [PREPARING] [ERROR] location: variable meter of type ch.fhnw.prog1.exercise.energymeter.EnergyMeter
09:39:57 [PREPARING] [ERROR] /git_15184062925998957846/src/test/java/ch/fhnw/prog1/exercise/energymeter/EnergyMeterTest.java:[85,14] cannot find symbol
09:39:57 [PREPARING] [ERROR] symbol: method fill(double)
09:39:57 [PREPARING] [ERROR] location: variable meter of type ch.fhnw.prog1.exercise.energymeter.EnergyMeter
09:39:57 [PREPARING] [ERROR] /git_15184062925998957846/src/test/java/ch/fhnw/prog1/exercise/energymeter/EnergyMeterTest.java:[86,31] cannot find symbol
09:39:57 [PREPARING] [ERROR] symbol: variable level
09:39:57 [PREPARING] [ERROR] location: variable meter of type ch.fhnw.prog1.exercise.energymeter.EnergyMeter
09:39:57 [PREPARING] [ERROR] /git_15184062925998957846/src/test/java/ch/fhnw/prog1/exercise/energymeter/EnergyMeterTest.java:[92,29] constructor EnergyMeter in class ch.fhnw.prog1.exercise.energymeter.EnergyMeter cannot be applied to given types;
09:39:57 [PREPARING] [ERROR] required: no arguments
09:39:57 [PREPARING] [ERROR] found: int
09:39:57 [PREPARING] [ERROR] reason: actual and formal argument lists differ in length
09:39:57 [PREPARING] [ERROR] /git_15184062925998957846/src/test/java/ch/fhnw/prog1/exercise/energymeter/EnergyMeterTest.java:[93,14] cannot find symbol
09:39:57 [PREPARING] [ERROR] symbol: method fill(int)
09:39:57 [PREPARING] [ERROR] location: variable meter of type ch.fhnw.prog1.exercise.energymeter.EnergyMeter
09:39:57 [PREPARING] [ERROR] /git_15184062925998957846/src/test/java/ch/fhnw/prog1/exercise/energymeter/EnergyMeterTest.java:[94,14] cannot find symbol
09:39:57 [PREPARING] [ERROR] symbol: method consume(int,int)
09:39:57 [PREPARING] [ERROR] location: variable meter of type ch.fhnw.prog1.exercise.energymeter.EnergyMeter
09:39:57 [PREPARING] [ERROR] /git_15184062925998957846/src/test/java/ch/fhnw/prog1/exercise/energymeter/EnergyMeterTest.java:[95,31] cannot find symbol
09:39:57 [PREPARING] [ERROR] symbol: variable level
09:39:57 [PREPARING] [ERROR] location: variable meter of type ch.fhnw.prog1.exercise.energymeter.EnergyMeter
09:39:57 [PREPARING] [ERROR] /git_15184062925998957846/src/test/java/ch/fhnw/prog1/exercise/energymeter/EnergyMeterTest.java:[97,14] cannot find symbol
09:39:57 [PREPARING] [ERROR] symbol: method consume(double,int)
09:39:57 [PREPARING] [ERROR] location: variable meter of type ch.fhnw.prog1.exercise.energymeter.EnergyMeter
09:39:57 [PREPARING] [ERROR] /git_15184062925998957846/src/test/java/ch/fhnw/prog1/exercise/energymeter/EnergyMeterTest.java:[98,31] cannot find symbol
09:39:57 [PREPARING] [ERROR] symbol: variable level
09:39:57 [PREPARING] [ERROR] location: variable meter of type ch.fhnw.prog1.exercise.energymeter.EnergyMeter
09:39:57 [PREPARING] [ERROR] /git_
09:39:57 [PREPARING] 15184062925998957846/src/test/java/ch/fhnw/prog1/exercise/energymeter/EnergyMeterTest.java:[100,14] cannot find symbol
09:39:57 [PREPARING] [ERROR] symbol: method consume(int,double)
09:39:57 [PREPARING] [ERROR] location: variable meter of type ch.fhnw.prog1.exercise.energymeter.EnergyMeter
09:39:57 [PREPARING] [ERROR] /git_15184062925998957846/src/test/java/ch/fhnw/prog1/exercise/energymeter/EnergyMeterTest.java:[101,31] cannot find symbol
09:39:57 [PREPARING] [ERROR] symbol: variable level
09:39:57 [PREPARING] [ERROR] location: variable meter of type ch.fhnw.prog1.exercise.energymeter.EnergyMeter
09:39:57 [PREPARING] [ERROR] /git_15184062925998957846/src/test/java/ch/fhnw/prog1/exercise/energymeter/EnergyMeterTest.java:[103,14] cannot find symbol
09:39:57 [PREPARING] [ERROR] symbol: method consume(int,int)
09:39:57 [PREPARING] [ERROR] location: variable meter of type ch.fhnw.prog1.exercise.energymeter.EnergyMeter
09:39:57 [PREPARING] [ERROR] /git_15184062925998957846/src/test/java/ch/fhnw/prog1/exercise/energymeter/EnergyMeterTest.java:[104,30] cannot find symbol
09:39:57 [PREPARING] [ERROR] symbol: variable level
09:39:57 [PREPARING] [ERROR] location: variable meter of type ch.fhnw.prog1.exercise.energymeter.EnergyMeter
09:39:57 [PREPARING] [ERROR] /git_15184062925998957846/src/test/java/ch/fhnw/prog1/exercise/energymeter/EnergyMeterTest.java:[110,29] constructor EnergyMeter in class ch.fhnw.prog1.exercise.energymeter.EnergyMeter cannot be applied to given types;
09:39:57 [PREPARING] [ERROR] required: no arguments
09:39:57 [PREPARING] [ERROR] found: int
09:39:57 [PREPARING] [ERROR] reason: actual and formal argument lists differ in length
09:39:57 [PREPARING] [ERROR] /git_15184062925998957846/src/test/java/ch/fhnw/prog1/exercise/energymeter/EnergyMeterTest.java:[112,18] cannot find symbol
09:39:57 [PREPARING] [ERROR] symbol: method consume(int,int)
09:39:57 [PREPARING] [ERROR] location: variable meter of type ch.fhnw.prog1.exercise.energymeter.EnergyMeter
09:39:57 [PREPARING] [ERROR] /git_15184062925998957846/src/test/java/ch/fhnw/prog1/exercise/energymeter/EnergyMeterTest.java:[115,18] cannot find symbol
09:39:57 [PREPARING] [ERROR] symbol: method consume(double,int)
09:39:57 [PREPARING] [ERROR] location: variable meter of type ch.fhnw.prog1.exercise.energymeter.EnergyMeter
09:39:57 [PREPARING] [ERROR] /git_15184062925998957846/src/test/java/ch/fhnw/prog1/exercise/energymeter/EnergyMeterTest.java:[118,18] cannot find symbol
09:39:57 [PREPARING] [ERROR] symbol: method consume(int,int)
09:39:57 [PREPARING] [ERROR] location: variable meter of type ch.fhnw.prog1.exercise.energymeter.EnergyMeter
09:39:57 [PREPARING] [ERROR] /git_15184062925998957846/src/test/java/ch/fhnw/prog1/exercise/energymeter/EnergyMeterTest.java:[121,18] cannot find symbol
09:39:57 [PREPARING] [ERROR] symbol: method consume(int,double)
09:39:57 [PREPARING] [ERROR] location: variable meter of type ch.fhnw.prog1.exercise.energymeter.EnergyMeter
09:39:57 [PREPARING] [ERROR] /git_15184062925998957846/src/test/java/ch/fhnw/prog1/exercise/energymeter/EnergyMeterTest.java:[124,18] cannot find symbol
09:39:57 [PREPARING] [ERROR] symbol: method consume(int,int)
09:39:57 [PREPARING] [ERROR] location: variable meter of type ch.fhnw.prog1.exercise.energymeter.EnergyMeter
09:39:57 [PREPARING] [ERROR] /git_15184062925998957846/src/test/java/ch/fhnw/prog1/exercise/energymeter/EnergyMeterTest.java:[128,18] cannot find symbol
09:39:57 [PREPARING] [ERROR] symbol: method consume(int,int)
09:39:57 [PREPARING] [ERROR] location: variable meter of type ch.fhnw.prog1.exercise.energymeter.EnergyMeter
09:39:57 [PREPARING] [ERROR] /git_15184062925998957846/src/test/java/ch/fhnw/prog1/exercise/energymeter/EnergyMeterTest.java:[131,18] cannot find symbol
09:39:57 [PREPARING] [ERROR] symbol: method consume(int,int)
09:39:57 [PREPARING] [ERROR] location: variable meter of type ch.fhnw.prog1.exercise.energymeter.EnergyMeter
09:39:57 [PREPARING] [ERROR] /git_15184062925998957846/src/test/java/ch/fhnw/prog1/exercise/energymeter/EnergyMeterTest.java:[134,18] cannot find symbol
09:39:57 [PREPARING] [ERROR] symbol: method consume(int,int)
09:39:57 [PREPARING] [ERROR] location: variable meter of type ch.fhnw.prog1.exercise.energymeter.EnergyMeter
09:39:57 [PREPARING] [ERROR] /git_15184062925998957846/src/test/java/ch/fhnw/prog1/exercise/energymeter/EnergyMeterTest.java:[141,29] constructor EnergyMeter in class ch.fhnw.prog1.exercise.energymeter.EnergyMeter cannot be applied to given types;
09:39:57 [PREPARING] [ERROR] required: no arguments
09:39:57 [PREPARING] [ERROR] found: int
09:39:57 [PREPARING] [ERROR] reason: actual and formal argument lists differ in length
09:39:57 [PREPARING] [ERROR] /git_15184062925998957846/src/test/java/ch/fhnw/prog1/exercise/energymeter/EnergyMeterTest.java:[142,14] cannot find symbol
09:39:57 [PREPARING] [ERROR] symbol: method fill(int)
09:39:57 [PREPARING] [ERROR] location: variable meter of type ch.fhnw.prog1.exercise.energymeter.EnergyMeter
09:39:57 [PREPARING] [ERROR] /git_15184062925998957846/src/test/java/ch/fhnw/prog1/exercise/energymeter/EnergyMeterTest.java:[143,14] cannot find symbol
09:39:57 [PREPARING] [ERROR] symbol: method consume(int,int)
09:39:57 [PREPARING] [ERROR] location: variable meter of type ch.fhnw.prog1.exercise.energymeter.EnergyMeter
09:39:57 [PREPARING] [ERROR] /git_15184062925998957846/src/test/java/ch/fhnw/prog1/exercise/energymeter/EnergyMeterTest.java:[144,30] cannot find symbol
09:39:57 [PREPARING] [ERROR] symbol: variable level
09:39:57 [PREPARING] [ERROR] location: variable meter of type ch.fhnw.prog1.exercise.energymeter.EnergyMeter
09:39:57 [PREPARING] [ERROR] /git_15184062925998957846/src/test/java/ch/fhnw/prog1/exercise/energymeter/EnergyMeterTest.java:[146,14] cannot find symbol
09:39:57 [PREPARING] [ERROR] symbol: method consume(double,double)
09:39:57 [PREPARING] [ERROR] location: variable meter of type ch.fhnw.prog1.exercise.energymeter.EnergyMeter
09:39:57 [PREPARING] [ERROR] /git_15184062925998957846/src/test/java/ch/fhnw/prog1/exercise/energymeter/EnergyMeterTest.java:[147,30] cannot find symbol
09:39:57 [PREPARING] [ERROR] symbol: variable level
09:39:57 [PREPARING] [ERROR] location: variable meter of type ch.fhnw.prog1.exercise.energymeter.EnergyMeter
09:39:57 [PREPARING] [ERROR] /git_15184062925998957846/src/test/java/ch/fhnw/prog1/exercise/energymeter/EnergyMeterTest.java:[153,29] constructor EnergyMeter in class ch.fhnw.prog1.exercise.energymeter.EnergyMeter cannot be applied to given types;
09:39:57 [PREPARING] [ERROR] required: no arguments
09:39:57 [PREPARING] [ERROR] found: int
09:39:57 [PREPARING] [ERROR] reason: actual and formal argument lists differ in length
09:39:57 [PREPARING] [ERROR] /git_15184062925998957846/src/test/java/ch/fhnw/prog1/exercise/energymeter/EnergyMeterTest.java:[154,30] cannot find symbol
09:39:57 [PREPARING] [ERROR] symbol: method percentFull()
09:39:57 [PREPARING] [ERROR] location: variable meter of type ch.fhnw.prog1.exercise.energymeter.EnergyMeter
09:39:57 [PREPARING] [ERROR] /git_15184062925998957846/src/test/java/ch/fhnw/prog1/exercise/energymeter/EnergyMeterTest.java:[156,14] cannot find symbol
09:39:57 [PREPARING] [ERROR] symbol: method fill(int)
09:39:57 [PREPARING] [ERROR] location: variable meter of type ch.fhnw.prog1.exercise.energymeter.EnergyMeter
09:39:57 [PREPARING] [ERROR] /git_15184062925998957846/src/test/java/ch/fhnw/prog1/exercise/energymeter/EnergyMeterTest.java:[157,31] cannot find symbol
09:39:57 [PREPARING] [ERROR] symbol: method percentFull()
09:39:57 [PREPARING] [ERROR] location: variable meter of type ch.fhnw.prog1.exercise.energymeter.EnergyMeter
09:39:57 [PREPARING] [ERROR] /git_15184062925998957846/src/test/java/ch/fhnw/prog1/exercise/energymeter/EnergyMeterTest.java:[159,14] cannot find symbol
09:39:57 [PREPARING] [ERROR] symbol: method fill(int)
09:39:57 [PREPARING] [ERROR] location: variable meter of type ch.fhnw.prog1.exercise.energymeter.EnergyMeter
09:39:57 [PREPARING] [ERROR] /git_15184062925998957846/src/test/java/ch/fhnw/prog1/exercise/energymeter/EnergyMeterTest.java:[160,33] cannot find symbol
09:39:57 [PREPARING] [ERROR] symbol: method percentFull()
09:39:57 [PREPARING] [ERROR] location: variable meter of type ch.fhnw.prog1.exercise.energymeter.EnergyMeter
09:39:57 [PREPARING] [ERROR] /git_15184062925998957846/src/test/java/ch/fhnw/prog1/exercise/energymeter/EnergyMeterTest.java:[162,14] cannot find symbol
09:39:57 [PREPARING] [ERROR] symbol: method fill(int)
09:39:57 [PREPARING] [ERROR] location: variable meter of type ch.fhnw.prog1.ex
09:39:57 [PREPARING] ercise.energymeter.EnergyMeter
09:39:57 [PREPARING] [ERROR] /git_15184062925998957846/src/test/java/ch/fhnw/prog1/exercise/energymeter/EnergyMeterTest.java:[163,32] cannot find symbol
09:39:57 [PREPARING] [ERROR] symbol: method percentFull()
09:39:57 [PREPARING] [ERROR] location: variable meter of type ch.fhnw.prog1.exercise.energymeter.EnergyMeter
09:39:57 [PREPARING] [ERROR] /git_15184062925998957846/src/test/java/ch/fhnw/prog1/exercise/energymeter/EnergyMeterTest.java:[169,29] constructor EnergyMeter in class ch.fhnw.prog1.exercise.energymeter.EnergyMeter cannot be applied to given types;
09:39:57 [PREPARING] [ERROR] required: no arguments
09:39:57 [PREPARING] [ERROR] found: int
09:39:57 [PREPARING] [ERROR] reason: actual and formal argument lists differ in length
09:39:57 [PREPARING] [ERROR] /git_15184062925998957846/src/test/java/ch/fhnw/prog1/exercise/energymeter/EnergyMeterTest.java:[170,32] cannot find symbol
09:39:57 [PREPARING] [ERROR] symbol: method percentFull()
09:39:57 [PREPARING] [ERROR] location: variable meter of type ch.fhnw.prog1.exercise.energymeter.EnergyMeter
09:39:57 [PREPARING] [ERROR] /git_15184062925998957846/src/test/java/ch/fhnw/prog1/exercise/energymeter/EnergyMeterTest.java:[171,14] cannot find symbol
09:39:57 [PREPARING] [ERROR] symbol: method fill(int)
09:39:57 [PREPARING] [ERROR] location: variable meter of type ch.fhnw.prog1.exercise.energymeter.EnergyMeter
09:39:57 [PREPARING] [ERROR] /git_15184062925998957846/src/test/java/ch/fhnw/prog1/exercise/energymeter/EnergyMeterTest.java:[172,32] cannot find symbol
09:39:57 [PREPARING] [ERROR] symbol: method percentFull()
09:39:57 [PREPARING] [ERROR] location: variable meter of type ch.fhnw.prog1.exercise.energymeter.EnergyMeter
09:39:57 [PREPARING] [ERROR] /git_15184062925998957846/src/test/java/ch/fhnw/prog1/exercise/energymeter/EnergyMeterTest.java:[173,14] cannot find symbol
09:39:57 [PREPARING] [ERROR] symbol: method consume(int,int)
09:39:57 [PREPARING] [ERROR] location: variable meter of type ch.fhnw.prog1.exercise.energymeter.EnergyMeter
09:39:57 [PREPARING] [ERROR] /git_15184062925998957846/src/test/java/ch/fhnw/prog1/exercise/energymeter/EnergyMeterTest.java:[174,32] cannot find symbol
09:39:57 [PREPARING] [ERROR] symbol: method percentFull()
09:39:57 [PREPARING] [ERROR] location: variable meter of type ch.fhnw.prog1.exercise.energymeter.EnergyMeter
09:39:57 [PREPARING] [ERROR] -> [Help 1]
09:39:57 [PREPARING] [ERROR]
09:39:57 [PREPARING] [ERROR] To see the full stack trace of the errors, re-run Maven with the -e switch.
09:39:57 [PREPARING] [ERROR] Re-run Maven using the -X switch to enable full debug logging.
09:39:57 [PREPARING] [ERROR]
09:39:57 [PREPARING] [ERROR] For more information about the errors and possible solutions, please read the following articles:
09:39:57 [PREPARING] [ERROR] [Help 1] http://cwiki.apache.org/confluence/display/MAVEN/MojoFailureException
09:39:57 [PREPARING] Failed to build student submission
09:39:57 [PREPARING] HINT: ensure your code can be compiled locally before running AutoFeedback evaluation